program: Orca
programVersion: 5.0.2
elementType: O O O C C C C C C C C C C C C C C C C C C C C C C H H H H H H H H H H H H H H H H H H H H H H H H H H
charge: 0
multiplicity: 1
keywords: wb97x-d3
keywords: def2-TZVPP
keywords: def2/J RIJCOSX
keywords: DEFGRID2
keywords: scfconv7
keywords: smallprint printgap noloewdin
keywords: NOSOSCF
formula: C22H26O3
InChI: InChI=1/C22H26O3/c1-15(2)10-19-20(22(19,3)4)21(23)25-14-17-12-18(24-13-17)11-16-8-6-5-7-9-16/h5-10,12-13,19-20H,11,14H2,1-4H3
51 atoms
O  1.067016 -1.115349 0.283224
O  3.016358 -1.867448 -0.512418
O  -2.868501 -2.335048 1.674723
C  2.875148 1.042844 -1.830013
C  3.955506 0.950711 -0.791511
C  2.560925 0.485877 -0.451203
C  2.27084 2.387744 -2.149443
C  2.944732 0.12456 -3.024238
C  4.496389 2.1427 -0.099879
C  2.275355 -0.94675 -0.246425
C  5.75495 2.587034 -0.169182
C  6.188972 3.796904 0.602074
C  6.830799 1.950147 -0.993828
C  0.603774 -2.456561 0.525969
C  -0.862583 -2.372792 0.725532
C  -1.849188 -2.105527 -0.278607
C  -1.542466 -2.499213 1.887112
C  -3.046758 -2.093558 0.348891
C  -4.429975 -1.8299 -0.12009
C  -4.954514 -0.508647 0.389626
C  -4.444561 0.686328 -0.113565
C  -5.9315 -0.458838 1.377294
C  -4.905966 1.905924 0.357835
C  -6.396153 0.762159 1.852158
C  -5.884892 1.947352 1.343974
H  4.664892 0.148332 -0.967632
H  1.972124 1.149096 0.173806
H  2.88685 2.9171 -2.879164
H  2.174307 3.025387 -1.271509
H  1.275945 2.267718 -2.581992
H  1.945301 -0.111857 -3.395004
H  3.45755 -0.812459 -2.816097
H  3.486286 0.617202 -3.833901
H  3.796504 2.695812 0.520392
H  6.554255 4.5794 -0.06802
H  5.380505 4.215311 1.201111
H  7.017174 3.555964 1.273456
H  7.643806 1.588139 -0.359395
H  6.481303 1.115597 -1.598303
H  7.274765 2.684618 -1.670224
H  1.102837 -2.863069 1.407679
H  0.840894 -3.094065 -0.326801
H  -1.680109 -1.944988 -1.331957
H  -1.230641 -2.705021 2.899378
H  -5.096572 -2.63905 0.188678
H  -4.414532 -1.831499 -1.211152
H  -3.680169 0.660563 -0.882054
H  -6.336275 -1.381319 1.776169
H  -4.503814 2.826183 -0.04574
H  -7.158423 0.785134 2.620336
H  -6.245891 2.898985 1.711544
elementType: O C H
totalener: -1079.74161930 hartree
nucrepener: 2023.98212868 hartree
electener: -3103.72374798 hartree
oneelecener: -5487.02061166 hartree
twoeener: 2383.29686368 hartree
cpcmener: -0.03210979 hartree
kineticenergy: 1074.86040492 hartree
xcener: -106.460011885452 hartree
chargesum: 0.0000000
charge: -0.277603 -0.504881 -0.286901 0.131553 0.028704 -0.127078 -0.262861 -0.285636 -0.287066 0.431635 -0.034579 -0.225677 -0.254391 0.076214 -0.088880 -0.319211 -0.021992 0.194539 -0.053100 0.031814 -0.194089 -0.188525 -0.163188 -0.159645 -0.172218 0.090750 0.090621 0.096294 0.089510 0.098593 0.101462 0.090719 0.097469 0.122411 0.094220 0.089947 0.094026 0.098034 0.090253 0.095409 0.120138 0.111900 0.165835 0.179804 0.108936 0.118335 0.147116 0.141765 0.159607 0.159698 0.160213
qa: -0.2776 -0.5049 -0.2869 0.1316 0.0287 -0.1271 -0.2629 -0.2856 -0.2871 0.4316 -0.0346 -0.2257 -0.2544 0.0762 -0.0889 -0.3192 -0.0220 0.1945 -0.0531 0.0318 -0.1941 -0.1885 -0.1632 -0.1596 -0.1722 0.0908 0.0906 0.0963 0.0895 0.0986 0.1015 0.0907 0.0975 0.1224 0.0942 0.0899 0.0940 0.0980 0.0903 0.0954 0.1201 0.1119 0.1658 0.1798 0.1089 0.1183 0.1471 0.1418 0.1596 0.1597 0.1602
va: 2.1194 1.9972 2.2649 3.6899 3.7533 3.9079 3.9036 3.9048 3.8755 4.1262 3.7196 3.9236 3.9446 3.8461 3.7259 3.9883 3.9443 3.6314 3.8142 3.6005 3.9312 3.9428 3.9038 3.8888 3.8924 1.0322 1.0381 1.0028 1.0037 1.0028 0.9993 1.0175 1.0012 1.0079 0.9965 1.0081 0.9954 0.9969 1.0080 0.9976 0.9970 1.0000 1.0058 0.9935 1.0087 1.0063 1.0020 1.0039 0.9907 0.9900 0.9896
dispcorr: -0.021319438 hartree
energy: -1079.762938734924
dipole: 25.53482 -26.08587 -0.55105 18.90433 -18.11351 0.79082 -10.82777 10.49681 -0.33096
magnitude: 1.01911 au
magnitude: 2.59037 debye
