program: Orca
programVersion: 5.0.2
elementType: O O O C C C C C C C C C C C C C C C C C C C C C C H H H H H H H H H H H H H H H H H H H H H H H H H H
charge: 0
multiplicity: 1
keywords: wb97x-d3
keywords: def2-TZVPP
keywords: def2/J RIJCOSX
keywords: DEFGRID2
keywords: scfconv7
keywords: smallprint printgap noloewdin
keywords: NOSOSCF
formula: C22H26O3
InChI: InChI=1/C22H26O3/c1-15(2)10-19-20(22(19,3)4)21(23)25-14-17-12-18(24-13-17)11-16-8-6-5-7-9-16/h5-10,12-13,19-20H,11,14H2,1-4H3
51 atoms
O  1.741749 -2.386686 -0.778416
O  2.018306 -1.584442 1.291688
O  -2.554369 -2.521746 -0.651664
C  3.896469 0.494512 -0.14965
C  2.537845 1.087752 0.057574
C  2.670826 -0.275801 -0.605013
C  4.777034 1.022029 -1.257093
C  4.679222 0.058493 1.064241
C  2.012154 2.220799 -0.728937
C  2.131847 -1.45588 0.092364
C  1.431214 3.320892 -0.237131
C  0.912828 4.389932 -1.151788
C  1.237665 3.607743 1.220359
C  0.950805 -3.492255 -0.297972
C  -0.46293 -3.062354 -0.132122
C  -1.065801 -2.397125 0.985374
C  -1.419148 -3.109348 -1.089238
C  -2.327957 -2.082881 0.61541
C  -3.393085 -1.280589 1.264925
C  -3.482374 0.108086 0.669426
C  -4.671739 0.57691 0.123775
C  -2.364332 0.941433 0.65712
C  -4.746676 1.852176 -0.425518
C  -2.435687 2.213362 0.110197
C  -3.628868 2.67338 -0.434997
H  2.197631 1.036474 1.086187
H  2.525377 -0.291215 -1.679344
H  4.222323 1.257837 -2.164393
H  5.537916 0.285003 -1.519722
H  5.292281 1.929133 -0.935648
H  5.310139 -0.802984 0.837205
H  4.049335 -0.197163 1.912858
H  5.336091 0.870893 1.380553
H  2.103816 2.137922 -1.808056
H  -0.164145 4.525594 -1.018661
H  1.374304 5.355238 -0.92938
H  1.095774 4.160638 -2.201181
H  1.605262 2.824167 1.879581
H  1.749477 4.533847 1.494142
H  0.179808 3.765582 1.445639
H  1.369859 -3.90052 0.621322
H  1.036907 -4.250589 -1.07385
H  -0.614089 -2.170716 1.937554
H  -1.433369 -3.517336 -2.088196
H  -3.158624 -1.214486 2.329235
H  -4.36072 -1.781356 1.185917
H  -5.548207 -0.060197 0.124727
H  -1.427201 0.591647 1.075372
H  -5.680083 2.20067 -0.84848
H  -1.557768 2.847815 0.108956
H  -3.684158 3.665627 -0.8635
elementType: O C H
totalener: -1079.73967966 hartree
nucrepener: 2171.23676917 hartree
electener: -3250.97644883 hartree
oneelecener: -5781.93884439 hartree
twoeener: 2530.96239556 hartree
cpcmener: -0.03011281 hartree
kineticenergy: 1074.85269805 hartree
xcener: -106.461146052425 hartree
chargesum: -0.0000000
charge: -0.292152 -0.506604 -0.283740 0.112356 0.036406 -0.091385 -0.270885 -0.278060 -0.268131 0.422387 -0.076190 -0.215972 -0.253772 0.078929 -0.093091 -0.298168 -0.036542 0.197914 -0.043772 0.033041 -0.204352 -0.228273 -0.125926 -0.102418 -0.219404 0.094501 0.088447 0.089225 0.098318 0.098134 0.099303 0.090073 0.095372 0.121407 0.090519 0.098221 0.090961 0.092636 0.103939 0.093149 0.118177 0.122521 0.164025 0.178823 0.115869 0.103748 0.142688 0.148399 0.159134 0.153540 0.156675
qa: -0.2922 -0.5066 -0.2837 0.1124 0.0364 -0.0914 -0.2709 -0.2781 -0.2681 0.4224 -0.0762 -0.2160 -0.2538 0.0789 -0.0931 -0.2982 -0.0365 0.1979 -0.0438 0.0330 -0.2044 -0.2283 -0.1259 -0.1024 -0.2194 0.0945 0.0884 0.0892 0.0983 0.0981 0.0993 0.0901 0.0954 0.1214 0.0905 0.0982 0.0910 0.0926 0.1039 0.0931 0.1182 0.1225 0.1640 0.1788 0.1159 0.1037 0.1427 0.1484 0.1591 0.1535 0.1567
va: 2.1172 1.9877 2.2652 3.6906 3.7551 3.8618 3.9120 3.8970 3.8424 4.1209 3.7631 3.9144 3.9345 3.8350 3.6797 3.9685 3.9668 3.6372 3.8267 3.6592 3.9433 3.9608 3.8658 3.8263 3.9590 1.0311 1.0380 1.0053 1.0018 1.0014 0.9995 1.0200 1.0000 1.0106 0.9939 0.9968 1.0082 1.0087 0.9981 0.9948 1.0094 0.9970 1.0156 0.9929 1.0047 1.0132 1.0029 1.0044 0.9896 0.9868 0.9940
dispcorr: -0.024972181 hartree
energy: -1079.764651841094
dipole: 16.04069 -15.98324 0.05745 21.57485 -21.16957 0.40528 0.10311 -0.71343 -0.61032
magnitude: 0.73488 au
magnitude: 1.86791 debye
