program: Orca
programVersion: 5.0.2
elementType: O O O C C C C C C C C C C C C C C C C C C C C C C H H H H H H H H H H H H H H H H H H H H H H H H H H
charge: 0
multiplicity: 1
keywords: wb97x-d3
keywords: def2-TZVPP
keywords: def2/J RIJCOSX
keywords: DEFGRID2
keywords: scfconv7
keywords: smallprint printgap noloewdin
keywords: NOSOSCF
formula: C22H26O3
InChI: InChI=1/C22H26O3/c1-15(2)10-19-20(22(19,3)4)21(23)25-14-17-12-18(24-13-17)11-16-8-6-5-7-9-16/h5-10,12-13,19-20H,11,14H2,1-4H3
51 atoms
O  1.436602 -1.466871 0.942974
O  1.769395 -1.710966 -1.254952
O  -2.501157 -2.277396 -1.034996
C  2.117429 1.44717 -0.743141
C  3.356031 0.800707 -1.299687
C  2.673351 0.18557 -0.105058
C  2.233089 2.712592 0.069597
C  0.848354 1.379498 -1.557427
C  4.701818 1.389389 -1.135271
C  1.935328 -1.085564 -0.232485
C  5.571712 1.654394 -2.114935
C  6.926125 2.218781 -1.808412
C  5.310926 1.413653 -3.571083
C  0.550283 -2.597595 0.960362
C  -0.75752 -2.265693 0.337442
C  -1.686061 -1.256206 0.755298
C  -1.304731 -2.844216 -0.754024
C  -2.723689 -1.304415 -0.113308
C  -3.976765 -0.513384 -0.256747
C  -4.37505 0.131407 1.042705
C  -5.052346 -0.607254 2.010375
C  -4.056877 1.458023 1.311879
C  -5.408912 -0.030645 3.220179
C  -4.410466 2.038603 2.524225
C  -5.087904 1.296242 3.480881
H  3.190167 0.270343 -2.231359
H  3.141027 0.340322 0.8619
H  1.352105 2.840146 0.701322
H  2.296187 3.583119 -0.586351
H  3.107282 2.720373 0.719359
H  0.815922 0.524494 -2.23043
H  0.75682 2.277233 -2.171574
H  -0.030634 1.333097 -0.910247
H  5.004519 1.611975 -0.115843
H  7.715745 1.568071 -2.193617
H  7.066753 3.189737 -2.290385
H  7.087743 2.345779 -0.738237
H  5.940594 0.60371 -3.949025
H  4.276162 1.162962 -3.795963
H  5.569232 2.299908 -4.155474
H  0.43461 -2.829757 2.017984
H  1.011045 -3.460316 0.47667
H  -1.585259 -0.588649 1.596798
H  -0.977937 -3.642153 -1.402477
H  -4.777224 -1.169905 -0.607115
H  -3.84527 0.251672 -1.027979
H  -5.305757 -1.642164 1.811661
H  -3.531565 2.043872 0.566854
H  -5.940104 -0.616178 3.959432
H  -4.158095 3.073029 2.718613
H  -5.367552 1.747999 4.423697
elementType: O C H
totalener: -1079.74021600 hartree
nucrepener: 2089.76085248 hartree
electener: -3169.50106849 hartree
oneelecener: -5618.87824119 hartree
twoeener: 2449.37717270 hartree
cpcmener: -0.03073852 hartree
kineticenergy: 1074.85530675 hartree
xcener: -106.461875213813 hartree
chargesum: -0.0000000
charge: -0.284134 -0.489897 -0.286974 0.127238 0.033137 -0.111556 -0.270657 -0.280621 -0.296725 0.401110 -0.034378 -0.223279 -0.259220 0.093817 -0.063831 -0.364944 -0.032790 0.202210 0.002668 0.002756 -0.200422 -0.188960 -0.152696 -0.157333 -0.171748 0.088411 0.096288 0.097817 0.097610 0.089595 0.091946 0.101149 0.094994 0.122159 0.093432 0.094487 0.088993 0.100635 0.092189 0.093713 0.123327 0.120690 0.160504 0.178908 0.109401 0.102773 0.142929 0.142961 0.160497 0.160071 0.161747
qa: -0.2841 -0.4899 -0.2870 0.1272 0.0331 -0.1116 -0.2707 -0.2806 -0.2967 0.4011 -0.0344 -0.2233 -0.2592 0.0938 -0.0638 -0.3649 -0.0328 0.2022 0.0027 0.0028 -0.2004 -0.1890 -0.1527 -0.1573 -0.1717 0.0884 0.0963 0.0978 0.0976 0.0896 0.0919 0.1011 0.0950 0.1222 0.0934 0.0945 0.0890 0.1006 0.0922 0.0937 0.1233 0.1207 0.1605 0.1789 0.1094 0.1028 0.1429 0.1430 0.1605 0.1601 0.1617
va: 2.1122 2.0109 2.2667 3.6796 3.7799 3.8328 3.9027 3.9055 3.8799 4.1984 3.7324 3.9234 3.9432 3.8256 3.6359 3.9448 3.9633 3.6432 3.7964 3.6311 3.9320 3.9133 3.8845 3.8911 3.8891 1.0335 1.0352 1.0021 1.0020 1.0043 1.0144 1.0020 1.0013 1.0087 0.9950 0.9965 1.0086 0.9955 1.0072 0.9982 0.9904 1.0061 1.0077 0.9956 1.0097 1.0041 1.0029 1.0043 0.9895 0.9899 0.9890
dispcorr: -0.023256870 hartree
energy: -1079.763472874270
dipole: 21.58221 -21.67383 -0.09162 18.51467 -17.67818 0.83649 -7.61760 8.41401 0.79641
magnitude: 1.15860 au
magnitude: 2.94494 debye
