program: Orca
programVersion: 5.0.2
elementType: O O O C C C C C C C C C C C C C C C C C C C C C C H H H H H H H H H H H H H H H H H H H H H H H H H H
charge: 0
multiplicity: 1
keywords: wb97x-d3
keywords: def2-TZVPP
keywords: def2/J RIJCOSX
keywords: DEFGRID2
keywords: scfconv7
keywords: smallprint printgap noloewdin
keywords: NOSOSCF
formula: C22H26O3
InChI: InChI=1/C22H26O3/c1-15(2)10-19-20(22(19,3)4)21(23)25-14-17-12-18(24-13-17)11-16-8-6-5-7-9-16/h5-10,12-13,19-20H,11,14H2,1-4H3
51 atoms
O  1.700749 -2.14487 -0.010116
O  1.16686 -1.172687 -1.955524
O  -2.365777 -2.744623 1.412533
C  1.726369 1.314404 -0.035103
C  2.712648 1.244724 -1.167321
C  2.458942 0.014267 -0.327915
C  2.092306 2.010205 1.253314
C  0.258612 1.44024 -0.366935
C  4.043766 1.879429 -1.10353
C  1.718847 -1.135329 -0.878287
C  4.663759 2.543416 -2.084701
C  6.037299 3.108464 -1.874921
C  4.099183 2.782637 -3.451666
C  0.834511 -3.265481 -0.273404
C  -0.558385 -2.946494 0.137263
C  -1.553131 -2.197275 -0.574774
C  -1.114359 -3.247627 1.333961
C  -2.624774 -2.100676 0.244776
C  -3.915754 -1.374978 0.13317
C  -3.8796 -0.092788 0.931394
C  -4.303172 -0.061631 2.2563
C  -3.363917 1.068815 0.362857
C  -4.213248 1.108824 2.9992
C  -3.274378 2.239989 1.10189
C  -3.698427 2.262681 2.424402
H  2.250355 1.21946 -2.148055
H  3.21792 -0.246018 0.401923
H  1.456063 1.655491 2.066289
H  1.940293 3.087624 1.163511
H  3.126178 1.841965 1.551436
H  -0.001503 1.026843 -1.339222
H  -0.028692 2.493483 -0.374133
H  -0.352266 0.940256 0.387703
H  4.573249 1.773076 -0.160922
H  6.04273 4.192176 -2.017262
H  6.422498 2.89687 -0.877727
H  6.743281 2.699945 -2.602771
H  3.068178 2.456363 -3.56827
H  4.138857 3.845989 -3.697798
H  4.698514 2.271217 -4.208322
H  1.236034 -4.074245 0.334333
H  0.898665 -3.565638 -1.319126
H  -1.480361 -1.781526 -1.566324
H  -0.754489 -3.799066 2.188872
H  -4.740084 -2.008399 0.469177
H  -4.088181 -1.155173 -0.920903
H  -4.709367 -0.956981 2.711693
H  -3.026646 1.055557 -0.667326
H  -4.54686 1.118882 4.028837
H  -2.872978 3.135065 0.644146
H  -3.630103 3.174944 3.002612
elementType: O C H
totalener: -1079.74064365 hartree
nucrepener: 2142.33045148 hartree
electener: -3222.07109513 hartree
oneelecener: -5724.17001383 hartree
twoeener: 2502.09891870 hartree
cpcmener: -0.02984445 hartree
kineticenergy: 1074.86350809 hartree
xcener: -106.463317616338 hartree
chargesum: -0.0000000
charge: -0.284799 -0.495061 -0.284670 0.133353 0.030856 -0.095853 -0.276607 -0.308762 -0.284539 0.418453 -0.052829 -0.219188 -0.254614 0.069589 -0.057850 -0.361881 -0.035711 0.221331 -0.042887 0.099555 -0.209999 -0.273964 -0.152655 -0.142838 -0.179261 0.090803 0.093463 0.097961 0.098081 0.091415 0.096661 0.105824 0.101415 0.119887 0.093894 0.089151 0.093058 0.090895 0.094369 0.098741 0.120681 0.121038 0.160765 0.178667 0.114188 0.111899 0.142277 0.152391 0.159879 0.162350 0.161080
qa: -0.2848 -0.4951 -0.2847 0.1334 0.0309 -0.0959 -0.2766 -0.3088 -0.2845 0.4185 -0.0528 -0.2192 -0.2546 0.0696 -0.0579 -0.3619 -0.0357 0.2213 -0.0429 0.0996 -0.2100 -0.2740 -0.1527 -0.1428 -0.1793 0.0908 0.0935 0.0980 0.0981 0.0914 0.0967 0.1058 0.1014 0.1199 0.0939 0.0892 0.0931 0.0909 0.0944 0.0987 0.1207 0.1210 0.1608 0.1787 0.1142 0.1119 0.1423 0.1524 0.1599 0.1623 0.1611
va: 2.1173 2.0061 2.2683 3.6784 3.7900 3.8119 3.9000 3.9099 3.8774 4.1775 3.7632 3.9195 3.9401 3.8426 3.6448 3.9775 3.9683 3.6193 3.8071 3.5108 3.9661 3.9243 3.8872 3.8538 3.9059 1.0321 1.0351 1.0018 1.0015 1.0064 1.0155 1.0012 0.9894 1.0109 0.9964 1.0088 0.9957 1.0098 0.9975 0.9959 0.9973 1.0074 1.0190 0.9925 1.0094 1.0096 1.0071 0.9976 0.9895 0.9886 0.9891
dispcorr: -0.024950634 hartree
energy: -1079.765594279738
dipole: 17.98017 -17.78256 0.19761 21.35527 -21.11058 0.24468 -5.91146 6.58377 0.67231
magnitude: 0.74224 au
magnitude: 1.88662 debye
