program: Orca
programVersion: 5.0.2
elementType: O O O C C C C C C C C C C C C C C C C C C C C C C H H H H H H H H H H H H H H H H H H H H H H H H H H
charge: 0
multiplicity: 1
keywords: wb97x-d3
keywords: def2-TZVPP
keywords: def2/J RIJCOSX
keywords: DEFGRID2
keywords: scfconv7
keywords: smallprint printgap noloewdin
keywords: NOSOSCF
formula: C22H26O3
InChI: InChI=1/C22H26O3/c1-15(2)10-19-20(22(19,3)4)21(23)25-14-17-12-18(24-13-17)11-16-8-6-5-7-9-16/h5-10,12-13,19-20H,11,14H2,1-4H3
51 atoms
O  1.782119 -1.932065 -0.026646
O  2.079656 -0.197141 1.355682
O  -2.660442 -1.766082 -0.39956
C  4.75427 0.144162 -0.230294
C  3.734964 1.095313 -0.770922
C  3.389599 -0.38402 -0.638209
C  5.904487 -0.305659 -1.100237
C  5.139538 0.251741 1.225504
C  3.82693 1.704115 -2.110895
C  2.370845 -0.79413 0.342029
C  3.25607 2.847889 -2.506014
C  3.449183 3.355379 -3.903895
C  2.385898 3.717095 -1.651181
C  0.725709 -2.460748 0.794741
C  -0.596999 -1.895203 0.418122
C  -1.097562 -0.564437 0.614119
C  -1.591766 -2.570678 -0.202433
C  -2.346898 -0.540527 0.096524
C  -3.380064 0.522017 0.005478
C  -4.584184 0.221234 0.864588
C  -4.521654 0.401914 2.244522
C  -5.760471 -0.262846 0.303044
C  -5.614357 0.106903 3.046244
C  -6.85636 -0.561676 1.103808
C  -6.786012 -0.378458 2.477496
H  3.267106 1.710312 -0.009976
H  3.383327 -0.95446 -1.559944
H  6.694222 0.447943 -1.110169
H  5.612664 -0.498501 -2.131444
H  6.334195 -1.228358 -0.70643
H  5.365793 -0.730097 1.64557
H  4.374209 0.716166 1.842447
H  6.041359 0.860126 1.315218
H  4.415936 1.161858 -2.844423
H  4.091663 2.703084 -4.495036
H  2.491648 3.44821 -4.423128
H  3.893687 4.354001 -3.899181
H  2.252495 3.350706 -0.634865
H  2.794764 4.729279 -1.590717
H  1.393555 3.81406 -2.100295
H  0.948914 -2.299827 1.849688
H  0.738438 -3.534096 0.612479
H  -0.596294 0.267933 1.080286
H  -1.677642 -3.590061 -0.545901
H  -3.690175 0.655705 -1.034206
H  -2.917324 1.458321 0.32094
H  -3.609566 0.778171 2.693605
H  -5.82261 -0.404332 -0.769431
H  -5.552381 0.256227 4.116542
H  -7.766152 -0.935694 0.652205
H  -7.639682 -0.607132 3.102106
elementType: O C H
totalener: -1079.74137882 hartree
nucrepener: 2048.50662755 hartree
electener: -3128.24800637 hartree
oneelecener: -5536.47426932 hartree
twoeener: 2408.22626296 hartree
cpcmener: -0.02993325 hartree
kineticenergy: 1074.84410849 hartree
xcener: -106.459527710250 hartree
chargesum: 0.0000000
charge: -0.291330 -0.512994 -0.288021 0.109752 0.004318 -0.074087 -0.288230 -0.278779 -0.270156 0.437769 -0.043709 -0.220102 -0.255796 0.075578 -0.097244 -0.293525 -0.034747 0.188375 -0.050766 0.040577 -0.199676 -0.192009 -0.160658 -0.160642 -0.174496 0.099470 0.091458 0.100160 0.091947 0.097815 0.100326 0.091224 0.096607 0.120052 0.088556 0.093566 0.093564 0.090541 0.096469 0.097033 0.119173 0.119859 0.163425 0.179128 0.111517 0.117947 0.145602 0.143400 0.160660 0.159546 0.161550
qa: -0.2913 -0.5130 -0.2880 0.1098 0.0043 -0.0741 -0.2882 -0.2788 -0.2702 0.4378 -0.0437 -0.2201 -0.2558 0.0756 -0.0972 -0.2935 -0.0347 0.1884 -0.0508 0.0406 -0.1997 -0.1920 -0.1607 -0.1606 -0.1745 0.0995 0.0915 0.1002 0.0919 0.0978 0.1003 0.0912 0.0966 0.1201 0.0886 0.0936 0.0936 0.0905 0.0965 0.0970 0.1192 0.1199 0.1634 0.1791 0.1115 0.1179 0.1456 0.1434 0.1607 0.1595 0.1615
va: 2.1197 1.9832 2.2685 3.6938 3.8080 3.8041 3.9187 3.8968 3.8876 4.1131 3.7574 3.9205 3.9389 3.8357 3.6940 4.0125 3.9643 3.6799 3.8081 3.5863 3.9359 3.9443 3.8955 3.8911 3.8913 1.0226 1.0335 1.0002 1.0063 1.0009 0.9989 1.0195 0.9997 1.0104 1.0084 0.9963 0.9960 1.0116 0.9969 0.9965 1.0097 0.9996 1.0173 0.9926 1.0065 1.0069 1.0026 1.0039 0.9900 0.9902 0.9892
dispcorr: -0.021602732 hartree
energy: -1079.762981551210
dipole: 23.75236 -23.39937 0.35299 15.06264 -15.13640 -0.07375 -8.88928 8.09952 -0.78976
magnitude: 0.86820 au
magnitude: 2.20678 debye
