program: Orca
programVersion: 5.0.2
elementType: O O O C C C C C C C C C C C C C C C C C C C C C C H H H H H H H H H H H H H H H H H H H H H H H H H H
charge: 0
multiplicity: 1
keywords: wb97x-d3
keywords: def2-TZVPP
keywords: def2/J RIJCOSX
keywords: DEFGRID2
keywords: scfconv7
keywords: smallprint printgap noloewdin
keywords: NOSOSCF
formula: C22H26O3
InChI: InChI=1/C22H26O3/c1-15(2)10-19-20(22(19,3)4)21(23)25-14-17-12-18(24-13-17)11-16-8-6-5-7-9-16/h5-10,12-13,19-20H,11,14H2,1-4H3
51 atoms
O  1.562771 -1.619716 0.243019
O  1.827557 0.398264 1.168501
O  -2.039006 0.085532 -1.075159
C  4.687147 0.268387 -0.084346
C  3.79512 0.95934 -1.06724
C  3.378523 -0.387337 -0.483836
C  5.934909 -0.434571 -0.565322
C  4.865698 0.890439 1.279236
C  4.108225 1.050977 -2.504797
C  2.204099 -0.455999 0.39883
C  3.844753 2.081656 -3.315532
C  4.253597 2.040071 -4.757642
C  3.160473 3.348975 -2.901249
C  0.348908 -1.816948 0.963901
C  -0.784674 -1.081724 0.337285
C  -2.097567 -0.933008 0.890267
C  -0.80835 -0.448314 -0.856219
C  -2.815891 -0.217216 -0.007687
C  -4.218594 0.279088 -0.029528
C  -5.002886 -0.25515 1.136411
C  -5.135425 0.485874 2.306035
C  -5.578883 -1.521284 1.073262
C  -5.834664 -0.025434 3.391966
C  -6.277948 -2.035352 2.155875
C  -6.407965 -1.287502 3.319398
H  3.25369 1.800212 -0.647503
H  3.483201 -1.235382 -1.150892
H  5.786745 -0.983843 -1.493854
H  6.27447 -1.150658 0.18498
H  6.742097 0.282744 -0.725285
H  4.031536 1.518426 1.581016
H  5.758684 1.518006 1.270826
H  5.010908 0.125685 2.04444
H  4.608545 0.190436 -2.938707
H  3.384017 2.120318 -5.415079
H  4.903345 2.883843 -5.004225
H  4.783993 1.122086 -5.00989
H  3.862389 4.185497 -2.918826
H  2.365808 3.599683 -3.606507
H  2.719566 3.308098 -1.908056
H  0.463633 -1.539064 2.013856
H  0.173123 -2.892671 0.933707
H  -2.446815 -1.313402 1.837114
H  -0.073037 -0.289639 -1.6295
H  -4.69434 -0.018926 -0.968322
H  -4.222629 1.372932 -0.014646
H  -4.689879 1.47172 2.367696
H  -5.479229 -2.108422 0.167828
H  -5.932167 0.564153 4.294382
H  -6.723558 -3.019535 2.090587
H  -6.954911 -1.686096 4.163926
elementType: O C H
totalener: -1079.74012992 hartree
nucrepener: 2044.24856706 hartree
electener: -3123.98869697 hartree
oneelecener: -5527.81972008 hartree
twoeener: 2403.83102310 hartree
cpcmener: -0.03112015 hartree
kineticenergy: 1074.85138781 hartree
xcener: -106.464614871842 hartree
chargesum: 0.0000000
charge: -0.299452 -0.495300 -0.293516 0.109526 0.032731 -0.080546 -0.277187 -0.280901 -0.285385 0.391647 -0.043897 -0.218066 -0.256814 0.118339 -0.058229 -0.315890 -0.060372 0.180819 0.005144 -0.004445 -0.187227 -0.197813 -0.160528 -0.157148 -0.168710 0.100705 0.089663 0.091059 0.097495 0.098308 0.090940 0.096061 0.099705 0.119639 0.094495 0.092887 0.088579 0.100870 0.093697 0.091377 0.115036 0.124957 0.162935 0.172063 0.108665 0.104829 0.142618 0.144143 0.160215 0.160403 0.161874
qa: -0.2995 -0.4953 -0.2935 0.1095 0.0327 -0.0805 -0.2772 -0.2809 -0.2854 0.3916 -0.0439 -0.2181 -0.2568 0.1183 -0.0582 -0.3159 -0.0604 0.1808 0.0051 -0.0044 -0.1872 -0.1978 -0.1605 -0.1571 -0.1687 0.1007 0.0897 0.0911 0.0975 0.0983 0.0909 0.0961 0.0997 0.1196 0.0945 0.0929 0.0886 0.1009 0.0937 0.0914 0.1150 0.1250 0.1629 0.1721 0.1087 0.1048 0.1426 0.1441 0.1602 0.1604 0.1619
va: 2.1141 1.9966 2.2572 3.6958 3.7897 3.8166 3.9134 3.8982 3.8857 4.1467 3.7544 3.9197 3.9395 3.8023 3.6799 3.9877 3.9544 3.6804 3.8128 3.6269 3.9221 3.9253 3.8922 3.8899 3.8866 1.0231 1.0363 1.0067 1.0013 1.0010 1.0208 0.9993 0.9993 1.0111 0.9966 0.9953 1.0088 0.9956 0.9973 1.0106 1.0122 0.9922 1.0004 0.9975 1.0066 1.0065 1.0038 1.0025 0.9900 0.9898 0.9888
dispcorr: -0.021931540 hartree
energy: -1079.762061459867
dipole: 25.09574 -24.81872 0.27702 9.36102 -9.95160 -0.59058 -10.04265 9.53452 -0.50813
magnitude: 0.82687 au
magnitude: 2.10174 debye
