program: Orca
programVersion: 5.0.2
elementType: O O O C C C C C C C C C C C C C C C C C C C C C C H H H H H H H H H H H H H H H H H H H H H H H H H H
charge: 0
multiplicity: 1
keywords: wb97x-d3
keywords: def2-TZVPP
keywords: def2/J RIJCOSX
keywords: DEFGRID2
keywords: scfconv7
keywords: smallprint printgap noloewdin
keywords: NOSOSCF
formula: C22H26O3
InChI: InChI=1/C22H26O3/c1-15(2)10-19-20(22(19,3)4)21(23)25-14-17-12-18(24-13-17)11-16-8-6-5-7-9-16/h5-10,12-13,19-20H,11,14H2,1-4H3
51 atoms
O  1.237545 -1.917551 -1.298651
O  0.292859 0.065964 -1.730806
O  -1.630787 -3.385389 1.641331
C  2.644662 1.005849 0.14419
C  2.965187 1.359622 -1.276635
C  2.553039 -0.05322 -0.947177
C  3.776336 0.83609 1.126454
C  1.395884 1.575565 0.770352
C  4.357698 1.60779 -1.727018
C  1.248005 -0.58779 -1.372894
C  4.897537 2.812093 -1.933867
C  6.315798 2.957683 -2.395144
C  4.162946 4.099966 -1.724291
C  0.003379 -2.619723 -1.536479
C  -0.815118 -2.672835 -0.297056
C  -1.700182 -1.675784 0.232136
C  -0.818229 -3.683164 0.602426
C  -2.164854 -2.157584 1.408718
C  -3.075312 -1.608639 2.450517
C  -3.850496 -0.430767 1.927903
C  -3.330795 0.857597 2.01024
C  -5.087277 -0.618767 1.317523
C  -4.034309 1.938467 1.494784
C  -5.7947 0.459444 0.804469
C  -5.268524 1.741881 0.889884
H  2.199323 1.952822 -1.767928
H  3.350815 -0.788067 -0.923735
H  3.457972 0.23077 1.97708
H  4.093037 1.807151 1.512641
H  4.648121 0.354837 0.684388
H  1.648795 2.487113 1.315229
H  0.957437 0.877737 1.48692
H  0.631526 1.837402 0.042434
H  4.979917 0.732193 -1.889161
H  6.366393 3.49644 -3.344829
H  6.901712 3.540317 -1.679702
H  6.806923 1.993971 -2.5282
H  4.681064 4.717688 -0.986241
H  4.13364 4.685597 -2.646703
H  3.139049 3.964104 -1.38011
H  0.307797 -3.620876 -1.835758
H  -0.540937 -2.171241 -2.367266
H  -1.956484 -0.728892 -0.214664
H  -0.31666 -4.638282 0.632793
H  -2.492758 -1.314584 3.329245
H  -3.762018 -2.391339 2.782781
H  -2.368351 1.017342 2.482363
H  -5.501744 -1.617598 1.246891
H  -3.618469 2.935072 1.568439
H  -6.758145 0.298004 0.338306
H  -5.819748 2.583721 0.491472
elementType: O C H
totalener: -1079.73979879 hartree
nucrepener: 2096.73283164 hartree
electener: -3176.47263042 hartree
oneelecener: -5633.01234881 hartree
twoeener: 2456.53971839 hartree
cpcmener: -0.02949057 hartree
kineticenergy: 1074.85257006 hartree
xcener: -106.460310910564 hartree
chargesum: 0.0000000
charge: -0.287365 -0.501858 -0.285251 0.158000 -0.007900 -0.133067 -0.268586 -0.308047 -0.265860 0.435280 -0.037520 -0.229021 -0.251192 0.071467 -0.101816 -0.291154 -0.033136 0.181543 0.007866 0.006887 -0.202726 -0.199378 -0.154498 -0.152992 -0.172264 0.098907 0.092707 0.099346 0.096032 0.091689 0.099455 0.102570 0.093151 0.123093 0.095047 0.094333 0.089637 0.096966 0.099159 0.087871 0.120361 0.119608 0.160464 0.179488 0.107211 0.105726 0.144743 0.142624 0.160450 0.160434 0.161514
qa: -0.2874 -0.5019 -0.2853 0.1580 -0.0079 -0.1331 -0.2686 -0.3080 -0.2659 0.4353 -0.0375 -0.2290 -0.2512 0.0715 -0.1018 -0.2912 -0.0331 0.1815 0.0079 0.0069 -0.2027 -0.1994 -0.1545 -0.1530 -0.1723 0.0989 0.0927 0.0993 0.0960 0.0917 0.0995 0.1026 0.0932 0.1231 0.0950 0.0943 0.0896 0.0970 0.0992 0.0879 0.1204 0.1196 0.1605 0.1795 0.1072 0.1057 0.1447 0.1426 0.1604 0.1604 0.1615
va: 2.1204 1.9992 2.2697 3.6494 3.7865 3.8960 3.9029 3.9015 3.8672 4.1428 3.7025 3.9264 3.9412 3.8442 3.7159 3.9354 3.9648 3.7002 3.8157 3.6188 3.9125 3.9390 3.8879 3.8859 3.8910 1.0227 1.0381 1.0026 1.0023 1.0026 1.0023 0.9990 1.0177 1.0065 0.9954 0.9961 1.0077 0.9973 0.9980 1.0082 0.9973 1.0083 1.0141 0.9926 1.0025 1.0102 1.0039 1.0032 0.9898 0.9895 0.9890
dispcorr: -0.023430696 hartree
energy: -1079.763229481742
dipole: 23.29926 -22.55727 0.74200 20.75896 -20.91422 -0.15526 -1.57269 2.15086 0.57817
magnitude: 0.95339 au
magnitude: 2.42332 debye
