program: Orca
programVersion: 5.0.2
elementType: O O O C C C C C C C C C C C C C C C C C C C C C C H H H H H H H H H H H H H H H H H H H H H H H H H H
charge: 0
multiplicity: 1
keywords: wb97x-d3
keywords: def2-TZVPP
keywords: def2/J RIJCOSX
keywords: DEFGRID2
keywords: scfconv7
keywords: smallprint printgap noloewdin
keywords: NOSOSCF
formula: C22H26O3
InChI: InChI=1/C22H26O3/c1-15(2)10-19-20(22(19,3)4)21(23)25-14-17-12-18(24-13-17)11-16-8-6-5-7-9-16/h5-10,12-13,19-20H,11,14H2,1-4H3
51 atoms
O  1.702908 -2.124056 0.054821
O  1.187661 -1.16257 -1.900884
O  -2.391299 -2.78449 1.38439
C  1.705389 1.340275 -0.001603
C  2.714135 1.262256 -1.112678
C  2.450905 0.040655 -0.263573
C  2.042584 2.051702 1.285971
C  0.244919 1.456242 -0.367126
C  4.038892 1.908427 -1.039888
C  1.724258 -1.116731 -0.816071
C  4.671431 2.547698 -2.02959
C  6.040235 3.122485 -1.81676
C  4.126048 2.748686 -3.411098
C  0.856394 -3.256083 -0.224101
C  -0.549425 -2.953438 0.15442
C  -1.532059 -2.202929 -0.573249
C  -1.134347 -3.276903 1.331396
C  -2.625663 -2.126944 0.21917
C  -3.917376 -1.406103 0.083368
C  -3.888578 -0.108262 0.8564
C  -4.277353 -0.061309 2.191787
C  -3.413568 1.053412 0.253562
C  -4.191737 1.123965 2.910994
C  -3.329325 2.239741 0.968927
C  -3.717026 2.277758 2.30205
H  2.268299 1.21764 -2.100209
H  3.197032 -0.206988 0.483793
H  1.396916 1.698143 2.091888
H  1.880999 3.12634 1.183577
H  3.073127 1.896487 1.601839
H  -0.382387 0.96515 0.379539
H  0.008385 1.029467 -1.339739
H  -0.044488 2.508587 -0.395662
H  4.554467 1.82698 -0.087191
H  6.043019 4.202566 -1.984925
H  6.413802 2.936521 -0.810163
H  6.756256 2.699759 -2.526411
H  4.188291 3.799973 -3.696867
H  4.72209 2.19904 -4.142341
H  3.091145 2.439026 -3.530401
H  1.254241 -4.059068 0.393725
H  0.946819 -3.556974 -1.267605
H  -1.43801 -1.773461 -1.55713
H  -0.792503 -3.838086 2.187352
H  -4.742905 -2.034825 0.424898
H  -4.082559 -1.2058 -0.975801
H  -4.654304 -0.955592 2.673772
H  -3.102367 1.027928 -0.784527
H  -4.498519 1.146266 3.948761
H  -2.958793 3.134225 0.484784
H  -3.652257 3.201525 2.862116
elementType: O C H
totalener: -1079.74058441 hartree
nucrepener: 2143.40344991 hartree
electener: -3223.14403432 hartree
oneelecener: -5726.34191536 hartree
twoeener: 2503.19788105 hartree
cpcmener: -0.02970935 hartree
kineticenergy: 1074.86431889 hartree
xcener: -106.463634651006 hartree
chargesum: 0.0000000
charge: -0.285261 -0.495632 -0.284740 0.132997 0.030974 -0.097198 -0.277074 -0.306984 -0.284102 0.420985 -0.051656 -0.219222 -0.255872 0.070602 -0.058612 -0.363525 -0.036785 0.224935 -0.043115 0.099994 -0.213359 -0.272220 -0.151424 -0.143395 -0.178852 0.090119 0.093657 0.097907 0.097994 0.091585 0.099991 0.096633 0.105342 0.119969 0.093914 0.089209 0.093191 0.094270 0.099329 0.091367 0.120606 0.121167 0.161655 0.178744 0.114604 0.110952 0.142805 0.149595 0.159931 0.162926 0.161083
qa: -0.2853 -0.4956 -0.2847 0.1330 0.0310 -0.0972 -0.2771 -0.3070 -0.2841 0.4210 -0.0517 -0.2192 -0.2559 0.0706 -0.0586 -0.3635 -0.0368 0.2249 -0.0431 0.1000 -0.2134 -0.2722 -0.1514 -0.1434 -0.1789 0.0901 0.0937 0.0979 0.0980 0.0916 0.1000 0.0966 0.1053 0.1200 0.0939 0.0892 0.0932 0.0943 0.0993 0.0914 0.1206 0.1212 0.1617 0.1787 0.1146 0.1110 0.1428 0.1496 0.1599 0.1629 0.1611
va: 2.1179 2.0053 2.2684 3.6760 3.7881 3.8155 3.9005 3.9083 3.8799 4.1730 3.7636 3.9196 3.9405 3.8417 3.6478 3.9767 3.9687 3.6164 3.8074 3.5123 3.9669 3.9222 3.8873 3.8465 3.9042 1.0325 1.0349 1.0017 1.0015 1.0063 0.9906 1.0155 1.0015 1.0110 0.9964 1.0088 0.9957 0.9977 0.9957 1.0096 0.9973 1.0074 1.0188 0.9926 1.0098 1.0100 1.0076 0.9999 0.9895 0.9881 0.9890
dispcorr: -0.024949408 hartree
energy: -1079.765533819234
dipole: 17.95982 -17.76070 0.19912 21.41542 -21.17127 0.24416 -5.86632 6.52516 0.65883
magnitude: 0.73029 au
magnitude: 1.85625 debye
