program: Orca
programVersion: 5.0.2
elementType: O O O C C C C C C C C C C C C C C C C C C C C C C H H H H H H H H H H H H H H H H H H H H H H H H H H
charge: 0
multiplicity: 1
keywords: wb97x-d3
keywords: def2-TZVPP
keywords: def2/J RIJCOSX
keywords: DEFGRID2
keywords: scfconv7
keywords: smallprint printgap noloewdin
keywords: NOSOSCF
formula: C22H26O3
InChI: InChI=1/C22H26O3/c1-15(2)10-19-20(22(19,3)4)21(23)25-14-17-12-18(24-13-17)11-16-8-6-5-7-9-16/h5-10,12-13,19-20H,11,14H2,1-4H3
51 atoms
O  1.750638 -2.122091 -0.116233
O  1.05131 -1.165198 -2.015745
O  -2.16596 -2.782597 1.610931
C  1.640279 1.347125 -0.161828
C  2.580126 1.295465 -1.333204
C  2.402158 0.067226 -0.4713
C  2.041392 2.071542 1.100257
C  0.155727 1.4249 -0.427174
C  3.886343 1.983781 -1.327339
C  1.671703 -1.108993 -0.977054
C  4.427071 2.687462 -2.327695
C  5.77691 3.322412 -2.171887
C  3.786072 2.917526 -3.661918
C  0.899302 -3.266732 -0.320111
C  -0.466628 -2.982474 0.194393
C  -1.5397 -2.287519 -0.456296
C  -0.911166 -3.255687 1.443253
C  -2.541929 -2.191129 0.447099
C  -3.860401 -1.507174 0.421685
C  -3.793369 -0.192439 1.162789
C  -3.402706 0.967017 0.497959
C  -4.059708 -0.127248 2.527314
C  -3.280159 2.168545 1.181856
C  -3.935221 1.07314 3.214843
C  -3.543999 2.224455 2.544408
H  2.080155 1.241508 -2.294185
H  3.199853 -0.16146 0.227283
H  1.850534 3.142194 1.002654
H  3.092712 1.941517 1.352798
H  1.454256 1.709055 1.94607
H  -0.404503 0.908826 0.355279
H  -0.136119 1.001136 -1.385811
H  -0.163677 2.468908 -0.422912
H  4.463773 1.893583 -0.411718
H  5.718618 4.405424 -2.307874
H  6.213359 3.128698 -1.192282
H  6.47288 2.954694 -2.930442
H  3.703032 3.9886 -3.864445
H  4.405772 2.50279 -4.461607
H  2.791059 2.487156 -3.756066
H  1.36767 -4.066534 0.250224
H  0.890931 -3.561033 -1.369414
H  -1.561498 -1.908358 -1.465059
H  -0.464228 -3.764504 2.283318
H  -4.63095 -2.148933 0.855324
H  -4.132007 -1.336838 -0.620587
H  -3.187754 0.928005 -0.563856
H  -4.369414 -1.02007 3.057567
H  -2.976702 3.061171 0.649913
H  -4.145542 1.109291 4.275997
H  -3.447447 3.159983 3.079808
elementType: O C H
totalener: -1079.74047692 hartree
nucrepener: 2145.96482345 hartree
electener: -3225.70530037 hartree
oneelecener: -5731.47873680 hartree
twoeener: 2505.77343643 hartree
cpcmener: -0.02986231 hartree
kineticenergy: 1074.85367367 hartree
xcener: -106.461520635814 hartree
chargesum: 0.0000000
charge: -0.285346 -0.495901 -0.284242 0.134101 0.031915 -0.095174 -0.277443 -0.307627 -0.285525 0.417632 -0.053307 -0.219256 -0.253115 0.070641 -0.056388 -0.363168 -0.036728 0.222798 -0.041859 0.101737 -0.274242 -0.212859 -0.143382 -0.151869 -0.179177 0.091607 0.092737 0.097932 0.091609 0.098210 0.099635 0.097608 0.105009 0.120918 0.093815 0.089124 0.093370 0.095381 0.097257 0.090443 0.121097 0.120547 0.160630 0.178214 0.114736 0.110739 0.149526 0.143283 0.163390 0.160111 0.160859
qa: -0.2853 -0.4959 -0.2842 0.1341 0.0319 -0.0952 -0.2774 -0.3076 -0.2855 0.4176 -0.0533 -0.2193 -0.2531 0.0706 -0.0564 -0.3632 -0.0367 0.2228 -0.0419 0.1017 -0.2742 -0.2129 -0.1434 -0.1519 -0.1792 0.0916 0.0927 0.0979 0.0916 0.0982 0.0996 0.0976 0.1050 0.1209 0.0938 0.0891 0.0934 0.0954 0.0973 0.0904 0.1211 0.1205 0.1606 0.1782 0.1147 0.1107 0.1495 0.1433 0.1634 0.1601 0.1609
va: 2.1177 2.0049 2.2680 3.6721 3.7885 3.8186 3.9008 3.9076 3.8715 4.1753 3.7617 3.9190 3.9396 3.8427 3.6436 3.9745 3.9687 3.6131 3.8063 3.5081 3.9226 3.9659 3.8441 3.8879 3.9050 1.0320 1.0352 1.0017 1.0063 1.0018 0.9895 1.0161 1.0016 1.0104 0.9961 1.0089 0.9960 0.9972 0.9964 1.0104 0.9972 1.0080 1.0185 0.9926 1.0092 1.0102 0.9999 1.0075 0.9880 0.9894 0.9892
dispcorr: -0.025048727 hartree
energy: -1079.765525644358
dipole: 16.71855 -16.49333 0.22522 21.99682 -21.72946 0.26736 -7.03202 7.69369 0.66168
magnitude: 0.74835 au
magnitude: 1.90214 debye
