program: Orca
programVersion: 5.0.2
elementType: O O O C C C C C C C C C C C C C C C C C C C C C C H H H H H H H H H H H H H H H H H H H H H H H H H H
charge: 0
multiplicity: 1
keywords: wb97x-d3
keywords: def2-TZVPP
keywords: def2/J RIJCOSX
keywords: DEFGRID2
keywords: scfconv7
keywords: smallprint printgap noloewdin
keywords: NOSOSCF
formula: C22H26O3
InChI: InChI=1/C22H26O3/c1-15(2)10-19-20(22(19,3)4)21(23)25-14-17-12-18(24-13-17)11-16-8-6-5-7-9-16/h5-10,12-13,19-20H,11,14H2,1-4H3
51 atoms
O  1.611076 -1.851049 -0.149928
O  1.875233 -0.073098 1.18323
O  -2.823963 -1.685855 -0.484436
C  4.593308 0.160494 -0.375852
C  3.609392 1.14841 -0.922819
C  3.205805 -0.303278 -0.793273
C  5.725767 -0.299475 -1.260702
C  4.976743 0.246168 1.080634
C  3.747867 1.739948 -2.275726
C  2.181067 -0.695833 0.189933
C  4.139522 2.991485 -2.531621
C  4.239231 3.501866 -3.936963
C  4.518219 3.980557 -1.472755
C  0.569018 -2.383623 0.688181
C  -0.764582 -1.823831 0.342222
C  -1.309592 -0.532945 0.652092
C  -1.731631 -2.470931 -0.349098
C  -2.555332 -0.501727 0.126398
C  -3.630771 0.521151 0.142315
C  -4.7908 0.106934 1.01548
C  -4.651339 0.097346 2.401743
C  -6.001372 -0.290758 0.459803
C  -5.702555 -0.295872 3.215826
C  -7.057068 -0.686304 1.273017
C  -6.910834 -0.690128 2.652603
H  3.174852 1.79922 -0.16981
H  3.182315 -0.87369 -1.715442
H  5.421318 -0.433231 -2.29823
H  6.128296 -1.25037 -0.907116
H  6.538484 0.429702 -1.244806
H  5.888068 0.839229 1.178692
H  5.185153 -0.742577 1.49414
H  4.217233 0.718673 1.699198
H  3.514834 1.093158 -3.116824
H  5.259234 3.821516 -4.16547
H  3.948849 2.749674 -4.670184
H  3.602809 4.378553 -4.082213
H  4.458041 3.57991 -0.462519
H  5.541794 4.330617 -1.628976
H  3.880997 4.867143 -1.522414
H  0.81108 -2.226089 1.739639
H  0.584192 -3.456181 0.500768
H  -0.841236 0.266353 1.202735
H  -1.781707 -3.456718 -0.785358
H  -3.981807 0.71752 -0.873944
H  -3.195962 1.451055 0.512427
H  -3.711219 0.403046 2.846759
H  -6.122679 -0.287205 -0.616917
H  -5.580707 -0.292893 4.291347
H  -7.994333 -0.991751 0.825984
H  -7.732518 -0.996596 3.28668
elementType: O C H
totalener: -1079.74062503 hartree
nucrepener: 2032.04593018 hartree
electener: -3111.78655522 hartree
oneelecener: -5503.61502504 hartree
twoeener: 2391.82846982 hartree
cpcmener: -0.02955440 hartree
kineticenergy: 1074.85020263 hartree
xcener: -106.459029994586 hartree
chargesum: -0.0000000
charge: -0.289747 -0.510345 -0.287199 0.151912 -0.000893 -0.125204 -0.267418 -0.299178 -0.275103 0.444433 -0.033422 -0.229052 -0.251551 0.072990 -0.094977 -0.292984 -0.035831 0.192955 -0.051930 0.030929 -0.194275 -0.191436 -0.163909 -0.159059 -0.173994 0.097379 0.090589 0.091368 0.098538 0.095910 0.096182 0.102974 0.092473 0.124821 0.094529 0.089438 0.094904 0.088153 0.096606 0.098407 0.119612 0.120207 0.162010 0.179524 0.109865 0.118536 0.146798 0.143185 0.160653 0.160021 0.161607
qa: -0.2897 -0.5103 -0.2872 0.1519 -0.0009 -0.1252 -0.2674 -0.2992 -0.2751 0.4444 -0.0334 -0.2291 -0.2516 0.0730 -0.0950 -0.2930 -0.0358 0.1930 -0.0519 0.0309 -0.1943 -0.1914 -0.1639 -0.1591 -0.1740 0.0974 0.0906 0.0914 0.0985 0.0959 0.0962 0.1030 0.0925 0.1248 0.0945 0.0894 0.0949 0.0882 0.0966 0.0984 0.1196 0.1202 0.1620 0.1795 0.1099 0.1185 0.1468 0.1432 0.1607 0.1600 0.1616
va: 2.1221 1.9867 2.2676 3.6528 3.7724 3.9110 3.9084 3.8992 3.8734 4.1088 3.7051 3.9259 3.9436 3.8371 3.6802 4.0072 3.9659 3.6667 3.8116 3.6023 3.9309 3.9432 3.9018 3.8886 3.8918 1.0255 1.0380 1.0025 1.0026 1.0028 1.0006 0.9985 1.0186 1.0066 0.9960 1.0078 0.9955 1.0081 0.9972 0.9979 1.0086 0.9993 1.0182 0.9926 1.0084 1.0066 1.0022 1.0036 0.9903 0.9900 0.9892
dispcorr: -0.021956486 hartree
energy: -1079.762581519067
dipole: 28.67068 -28.09013 0.58054 15.28988 -15.37864 -0.08875 -8.41792 7.73816 -0.67976
magnitude: 0.89832 au
magnitude: 2.28335 debye
