program: Orca
programVersion: 5.0.2
elementType: O O O C C C C C C C C C C C C C C C C C C C C C C H H H H H H H H H H H H H H H H H H H H H H H H H H
charge: 0
multiplicity: 1
keywords: wb97x-d3
keywords: def2-TZVPP
keywords: def2/J RIJCOSX
keywords: DEFGRID2
keywords: scfconv7
keywords: smallprint printgap noloewdin
keywords: NOSOSCF
formula: C22H26O3
InChI: InChI=1/C22H26O3/c1-15(2)10-19-20(22(19,3)4)21(23)25-14-17-12-18(24-13-17)11-16-8-6-5-7-9-16/h5-10,12-13,19-20H,11,14H2,1-4H3
51 atoms
O  1.146409 -1.022934 -1.445807
O  1.011129 1.206207 -1.288887
O  -2.382694 -2.064453 1.053429
C  3.646728 0.709719 0.40355
C  3.953419 1.34088 -0.910086
C  3.090044 0.095428 -0.875334
C  4.711273 -0.107508 1.093073
C  2.730492 1.4235 1.366778
C  5.305046 1.293404 -1.526127
C  1.660358 0.185156 -1.216046
C  5.539564 1.298136 -2.840965
C  6.933154 1.276634 -3.389471
C  4.451627 1.319245 -3.869639
C  -0.252209 -1.129427 -1.766225
C  -1.09184 -1.211865 -0.541871
C  -1.442342 -0.172844 0.383577
C  -1.691533 -2.332156 -0.076381
C  -2.22153 -0.744521 1.33029
C  -2.93234 -0.203865 2.516388
C  -4.428702 -0.193049 2.313262
C  -5.013358 0.769132 1.492903
C  -5.24044 -1.153857 2.905982
C  -6.382721 0.773683 1.273047
C  -6.613168 -1.15258 2.687166
C  -7.187496 -0.189903 1.869312
H  3.390457 2.249393 -1.110461
H  3.565354 -0.832517 -1.172589
H  4.256879 -0.827432 1.776018
H  5.36796 0.536178 1.681678
H  5.331912 -0.665039 0.391908
H  3.322938 2.028475 2.05548
H  2.158605 0.711625 1.964921
H  2.027705 2.091595 0.874026
H  6.154134 1.280483 -0.84837
H  7.685651 1.25328 -2.601609
H  7.086597 0.404659 -4.030397
H  7.122637 2.154263 -4.012544
H  4.500689 0.426978 -4.499352
H  3.452124 1.370922 -3.441124
H  4.572978 2.173626 -4.540138
H  -0.338599 -2.049857 -2.34093
H  -0.557665 -0.304123 -2.409464
H  -1.159868 0.866537 0.346071
H  -1.715354 -3.349381 -0.435797
H  -2.567661 0.810131 2.686899
H  -2.680868 -0.787026 3.406056
H  -4.389322 1.521399 1.023911
H  -4.798636 -1.906846 3.547794
H  -6.823186 1.53026 0.636468
H  -7.23318 -1.905578 3.156582
H  -8.256222 -0.187074 1.698869
elementType: O C H
totalener: -1079.73997943 hartree
nucrepener: 2053.92243048 hartree
electener: -3133.66240990 hartree
oneelecener: -5547.28897144 hartree
twoeener: 2413.62656153 hartree
cpcmener: -0.02879460 hartree
kineticenergy: 1074.85377747 hartree
xcener: -106.459979207264 hartree
chargesum: -0.0000000
charge: -0.288680 -0.509771 -0.287030 0.160554 -0.030641 -0.103891 -0.289990 -0.281646 -0.294044 0.429194 -0.014911 -0.229626 -0.242504 0.069703 -0.083733 -0.313619 -0.035200 0.202073 -0.052462 0.039307 -0.198470 -0.193593 -0.162019 -0.161481 -0.174091 0.102111 0.094959 0.098317 0.099426 0.093521 0.098141 0.099425 0.091740 0.125658 0.090085 0.095199 0.096198 0.098669 0.079155 0.100587 0.118687 0.120539 0.161704 0.179377 0.118325 0.111362 0.146939 0.143545 0.161002 0.160554 0.161345
qa: -0.2887 -0.5098 -0.2870 0.1606 -0.0306 -0.1039 -0.2900 -0.2816 -0.2940 0.4292 -0.0149 -0.2296 -0.2425 0.0697 -0.0837 -0.3136 -0.0352 0.2021 -0.0525 0.0393 -0.1985 -0.1936 -0.1620 -0.1615 -0.1741 0.1021 0.0950 0.0983 0.0994 0.0935 0.0981 0.0994 0.0917 0.1257 0.0901 0.0952 0.0962 0.0987 0.0792 0.1006 0.1187 0.1205 0.1617 0.1794 0.1183 0.1114 0.1469 0.1435 0.1610 0.1606 0.1613
va: 2.1164 1.9827 2.2693 3.6929 3.8281 3.8191 3.9075 3.8891 3.8831 4.0992 3.7051 3.9295 3.9371 3.8442 3.6706 3.9959 3.9683 3.6566 3.8105 3.5897 3.9339 3.9469 3.9002 3.8914 3.8922 1.0266 1.0314 1.0027 0.9993 1.0014 1.0023 1.0000 1.0158 1.0023 1.0062 0.9962 0.9960 0.9983 1.0172 0.9997 0.9986 1.0078 1.0181 0.9926 1.0070 1.0078 1.0020 1.0040 0.9899 0.9898 0.9893
dispcorr: -0.022819197 hartree
energy: -1079.762798622703
dipole: 27.91246 -27.27005 0.64241 7.94132 -8.56244 -0.62111 -5.71968 5.71846 -0.00123
magnitude: 0.89358 au
magnitude: 2.27129 debye
