program: Orca
programVersion: 5.0.2
elementType: O O O C C C C C C C C C C C C C C C C C C C C C C H H H H H H H H H H H H H H H H H H H H H H H H H H
charge: 0
multiplicity: 1
keywords: wb97x-d3
keywords: def2-TZVPP
keywords: def2/J RIJCOSX
keywords: DEFGRID2
keywords: scfconv7
keywords: smallprint printgap noloewdin
keywords: NOSOSCF
formula: C22H26O3
InChI: InChI=1/C22H26O3/c1-15(2)10-19-20(22(19,3)4)21(23)25-14-17-12-18(24-13-17)11-16-8-6-5-7-9-16/h5-10,12-13,19-20H,11,14H2,1-4H3
51 atoms
O  1.761943 -2.109642 0.146303
O  1.30622 -1.354591 -1.912277
O  -2.559058 -2.445508 -0.420085
C  1.105271 1.276844 -0.138975
C  2.227484 1.36589 -1.123703
C  2.122899 0.144885 -0.236505
C  1.147339 2.074494 1.141549
C  -0.299247 1.079426 -0.659739
C  3.367944 2.301357 -0.970419
C  1.700082 -1.152898 -0.785568
C  4.461884 2.302694 -1.737611
C  5.552746 3.3100 -1.536401
C  4.702234 1.322533 -2.844821
C  0.985994 -3.299954 -0.080806
C  -0.455771 -2.966474 0.062332
C  -1.109301 -2.511867 1.253927
C  -1.385338 -2.896114 -0.918052
C  -2.380654 -2.206826 0.905784
C  -3.508153 -1.585397 1.650838
C  -3.447214 -0.079339 1.542598
C  -2.743952 0.662374 2.48779
C  -4.031174 0.583316 0.466316
C  -2.628172 2.040446 2.363846
C  -3.916651 1.961628 0.339704
C  -3.2144 2.694342 1.287738
H  1.924656 1.180898 -2.15045
H  2.806801 0.082652 0.602958
H  0.529034 1.594519 1.902979
H  0.751962 3.080083 0.983465
H  2.153279 2.168791 1.549444
H  -0.895442 0.481181 0.033132
H  -0.331727 0.599155 -1.63475
H  -0.787924 2.049569 -0.762372
H  3.296537 3.044509 -0.18177
H  5.341336 3.985592 -0.708033
H  6.508251 2.817658 -1.338301
H  5.698558 3.913249 -2.436273
H  5.648076 0.795927 -2.687126
H  3.917936 0.571988 -2.938378
H  4.795342 1.836387 -3.806626
H  1.31598 -3.994696 0.689187
H  1.207421 -3.740962 -1.053007
H  -0.679287 -2.412408 2.238706
H  -1.360786 -3.134752 -1.969902
H  -3.440733 -1.886736 2.696992
H  -4.461205 -1.957122 1.267849
H  -2.282911 0.156906 3.328601
H  -4.581483 0.018771 -0.27724
H  -2.082169 2.60356 3.109997
H  -4.377351 2.464281 -0.501149
H  -3.126648 3.768672 1.190226
elementType: O C H
totalener: -1079.73839584 hartree
nucrepener: 2205.46264324 hartree
electener: -3285.20103908 hartree
oneelecener: -5850.65701055 hartree
twoeener: 2565.45597147 hartree
cpcmener: -0.02967850 hartree
kineticenergy: 1074.84620221 hartree
xcener: -106.461181607940 hartree
chargesum: -0.0000000
charge: -0.294234 -0.489560 -0.280007 0.228236 -0.071732 -0.068104 -0.323250 -0.273094 -0.271246 0.376685 -0.021349 -0.233423 -0.251177 0.097831 -0.057574 -0.343812 -0.036762 0.203273 -0.051667 0.043438 -0.176015 -0.189472 -0.183704 -0.162789 -0.164686 0.102100 0.094816 0.097838 0.106136 0.096406 0.043949 0.102532 0.108360 0.126189 0.089510 0.094218 0.095076 0.096122 0.080475 0.098846 0.122637 0.117574 0.160775 0.176416 0.111884 0.111529 0.141377 0.139862 0.161309 0.158791 0.159467
qa: -0.2942 -0.4896 -0.2800 0.2282 -0.0717 -0.0681 -0.3233 -0.2731 -0.2712 0.3767 -0.0213 -0.2334 -0.2512 0.0978 -0.0576 -0.3438 -0.0368 0.2033 -0.0517 0.0434 -0.1760 -0.1895 -0.1837 -0.1628 -0.1647 0.1021 0.0948 0.0978 0.1061 0.0964 0.0439 0.1025 0.1084 0.1262 0.0895 0.0942 0.0951 0.0961 0.0805 0.0988 0.1226 0.1176 0.1608 0.1764 0.1119 0.1115 0.1414 0.1399 0.1613 0.1588 0.1595
va: 2.0971 2.0002 2.2585 3.6303 3.8620 3.8105 3.9163 3.8775 3.8906 4.1945 3.7113 3.9297 3.9415 3.8308 3.6290 3.9634 3.9416 3.6091 3.8080 3.5819 3.8649 3.9160 3.8579 3.8802 3.8402 1.0192 1.0334 1.0023 0.9978 1.0047 1.0094 1.0250 0.9999 1.0038 1.0069 0.9963 0.9951 0.9979 1.0178 0.9974 0.9927 1.0091 1.0097 0.9982 1.0100 1.0140 1.0034 1.0085 0.9893 0.9904 0.9905
dispcorr: -0.028119808 hartree
energy: -1079.766515644910
dipole: 16.06735 -15.93662 0.13073 18.55438 -18.31959 0.23479 -2.11692 3.37958 1.26266
magnitude: 1.29094 au
magnitude: 3.28131 debye
