program: Orca
programVersion: 5.0.2
elementType: O O O C C C C C C C C C C C C C C C C C C C C C C H H H H H H H H H H H H H H H H H H H H H H H H H H
charge: 0
multiplicity: 1
keywords: wb97x-d3
keywords: def2-TZVPP
keywords: def2/J RIJCOSX
keywords: DEFGRID2
keywords: scfconv7
keywords: smallprint printgap noloewdin
keywords: NOSOSCF
formula: C22H26O3
InChI: InChI=1/C22H26O3/c1-15(2)10-19-20(22(19,3)4)21(23)25-14-17-12-18(24-13-17)11-16-8-6-5-7-9-16/h5-10,12-13,19-20H,11,14H2,1-4H3
51 atoms
O  1.141059 -0.995257 -1.460566
O  1.028855 1.232216 -1.272815
O  -2.473777 -2.082786 0.913513
C  3.656839 0.689741 0.415668
C  3.965788 1.338947 -0.888249
C  3.096514 0.096199 -0.871449
C  4.721144 -0.140167 1.090462
C  2.746446 1.393485 1.391377
C  5.319225 1.306516 -1.500433
C  1.667791 0.203957 -1.212899
C  5.560949 1.38374 -2.811719
C  6.957702 1.397661 -3.352087
C  4.478633 1.462164 -3.843264
C  -0.252762 -1.079158 -1.80765
C  -1.116123 -1.191651 -0.602553
C  -1.436336 -0.198166 0.382606
C  -1.777322 -2.308853 -0.221348
C  -2.259052 -0.792031 1.277696
C  -2.950857 -0.30442 2.498955
C  -4.448206 -0.245619 2.314387
C  -5.047908 0.89822 1.794771
C  -5.247983 -1.34195 2.622496
C  -6.419123 0.947171 1.587205
C  -6.619828 -1.297693 2.41129
C  -7.209214 -0.153625 1.891429
H  3.403273 2.250108 -1.076424
H  3.565356 -0.830632 -1.181809
H  4.267606 -0.863019 1.770807
H  5.386011 0.494714 1.679448
H  5.333406 -0.695485 0.380206
H  2.178241 0.675604 1.985964
H  2.040862 2.066744 0.909503
H  3.34369 1.991431 2.082316
H  6.16504 1.251878 -0.820825
H  7.705675 1.332013 -2.562308
H  7.119433 0.566408 -4.042935
H  7.14649 2.311801 -3.920675
H  4.541115 0.614285 -4.530302
H  3.476309 1.473676 -3.418414
H  4.594018 2.36023 -4.455158
H  -0.338764 -1.981965 -2.410181
H  -0.538134 -0.233183 -2.433081
H  -1.103299 0.826076 0.419609
H  -1.840872 -3.298195 -0.647336
H  -2.560864 0.687942 2.726753
H  -2.704736 -0.946551 3.348708
H  -4.435754 1.75903 1.553386
H  -4.797736 -2.23673 3.03506
H  -6.870893 1.845677 1.187498
H  -7.229223 -2.158213 2.654738
H  -8.278419 -0.117568 1.729331
elementType: O C H
totalener: -1079.74009073 hartree
nucrepener: 2050.22786730 hartree
electener: -3129.96795803 hartree
oneelecener: -5539.89336651 hartree
twoeener: 2409.92540848 hartree
cpcmener: -0.02886252 hartree
kineticenergy: 1074.85722990 hartree
xcener: -106.460777874860 hartree
chargesum: 0.0000000
charge: -0.288817 -0.510261 -0.287772 0.161525 -0.035414 -0.100714 -0.291595 -0.279498 -0.291114 0.429406 -0.014641 -0.229315 -0.243118 0.070229 -0.084336 -0.311255 -0.034138 0.196586 -0.050842 0.060386 -0.210120 -0.200156 -0.153432 -0.160159 -0.178340 0.101397 0.094944 0.098441 0.099586 0.093559 0.099178 0.091488 0.098038 0.125692 0.090118 0.095221 0.095837 0.098652 0.078886 0.099888 0.118416 0.120430 0.161786 0.178085 0.112179 0.116422 0.144788 0.142175 0.160227 0.160110 0.161364
qa: -0.2888 -0.5103 -0.2878 0.1615 -0.0354 -0.1007 -0.2916 -0.2795 -0.2911 0.4294 -0.0146 -0.2293 -0.2431 0.0702 -0.0843 -0.3113 -0.0341 0.1966 -0.0508 0.0604 -0.2101 -0.2002 -0.1534 -0.1602 -0.1783 0.1014 0.0949 0.0984 0.0996 0.0936 0.0992 0.0915 0.0980 0.1257 0.0901 0.0952 0.0958 0.0987 0.0789 0.0999 0.1184 0.1204 0.1618 0.1781 0.1122 0.1164 0.1448 0.1422 0.1602 0.1601 0.1614
va: 2.1172 1.9809 2.2716 3.6943 3.8303 3.8231 3.9087 3.8873 3.8814 4.0972 3.7057 3.9292 3.9381 3.8460 3.6696 4.0040 3.9694 3.6700 3.8126 3.5667 3.9415 3.9501 3.8852 3.8921 3.8951 1.0271 1.0314 1.0028 0.9991 1.0013 1.0002 1.0158 1.0021 1.0023 1.0062 0.9962 0.9959 0.9983 1.0172 0.9996 0.9988 1.0079 1.0174 0.9927 1.0089 1.0045 1.0030 1.0076 0.9898 0.9899 0.9893
dispcorr: -0.022697613 hartree
energy: -1079.762788342179
dipole: 28.20107 -27.54328 0.65778 8.22956 -8.84976 -0.62020 -5.37419 5.37528 0.00109
magnitude: 0.90406 au
magnitude: 2.29795 debye
