program: Orca
programVersion: 5.0.2
elementType: O O O C C C C C C C C C C C C C C C C C C C C C C H H H H H H H H H H H H H H H H H H H H H H H H H H
charge: 0
multiplicity: 1
keywords: wb97x-d3
keywords: def2-TZVPP
keywords: def2/J RIJCOSX
keywords: DEFGRID2
keywords: scfconv7
keywords: smallprint printgap noloewdin
keywords: NOSOSCF
formula: C22H26O3
InChI: InChI=1/C22H26O3/c1-15(2)10-19-20(22(19,3)4)21(23)25-14-17-12-18(24-13-17)11-16-8-6-5-7-9-16/h5-10,12-13,19-20H,11,14H2,1-4H3
51 atoms
O  1.609605 -1.716427 -0.0781
O  1.878569 0.115839 1.175804
O  -1.899676 0.335582 -1.138008
C  4.786896 0.078787 -0.031852
C  3.936494 1.036214 -0.787436
C  3.440787 -0.387963 -0.568356
C  5.985088 -0.538324 -0.712179
C  4.995203 0.292973 1.446917
C  4.254015 1.50549 -2.159139
C  2.260183 -0.602844 0.279222
C  3.349707 1.98047 -3.020434
C  3.744185 2.465859 -4.38099
C  1.886508 2.06475 -2.7132
C  0.368067 -1.992137 0.568973
C  -0.712413 -1.086484 0.085972
C  -1.959842 -0.83363 0.741607
C  -0.733364 -0.356202 -1.051552
C  -2.640512 0.034683 -0.044646
C  -3.966625 0.698592 0.079304
C  -4.783203 0.083907 1.182609
C  -5.498333 -1.089315 0.954941
C  -4.814461 0.653238 2.451175
C  -6.233769 -1.678443 1.972981
C  -5.548158 0.064978 3.474017
C  -6.26075 -1.102074 3.237036
H  3.423381 1.762326 -0.16207
H  3.500961 -1.047531 -1.426234
H  6.255856 -1.476695 -0.225252
H  6.847726 0.127663 -0.647744
H  5.806866 -0.753714 -1.765537
H  5.110012 -0.658123 1.970074
H  4.185678 0.844064 1.91934
H  5.911763 0.864694 1.603632
H  5.295452 1.474023 -2.466052
H  3.458377 3.511315 -4.521777
H  4.817008 2.382499 -4.553108
H  3.230667 1.898852 -5.161685
H  1.630396 1.703019 -1.718793
H  1.534042 3.096093 -2.795144
H  1.309168 1.485898 -3.439139
H  0.467928 -1.934616 1.65476
H  0.146612 -3.030513 0.320834
H  -2.293155 -1.24878 1.679726
H  -0.033903 -0.221514 -1.861941
H  -4.501886 0.61845 -0.870995
H  -3.827976 1.767706 0.266341
H  -5.480261 -1.543723 -0.028805
H  -4.262186 1.565983 2.641087
H  -6.788894 -2.587197 1.779256
H  -5.563769 0.52134 4.455319
H  -6.836285 -1.55933 4.031356
elementType: O C H
totalener: -1079.73867754 hartree
nucrepener: 2080.09443690 hartree
electener: -3159.83311444 hartree
oneelecener: -5599.50280986 hartree
twoeener: 2439.66969542 hartree
cpcmener: -0.03026069 hartree
kineticenergy: 1074.85066932 hartree
xcener: -106.463539141132 hartree
chargesum: 0.0000000
charge: -0.297643 -0.498122 -0.294879 0.161726 -0.023382 -0.078427 -0.292416 -0.278167 -0.299302 0.374180 0.002758 -0.230845 -0.260071 0.117224 -0.065750 -0.310616 -0.073471 0.176599 0.000115 -0.004355 -0.197197 -0.185122 -0.155488 -0.160451 -0.169054 0.102251 0.091998 0.098881 0.100813 0.092244 0.100488 0.091231 0.095493 0.125936 0.096106 0.089907 0.095391 0.075582 0.105161 0.099988 0.115851 0.120940 0.164308 0.198208 0.108974 0.104184 0.143590 0.142878 0.160266 0.160066 0.161421
qa: -0.2976 -0.4981 -0.2949 0.1617 -0.0234 -0.0784 -0.2924 -0.2782 -0.2993 0.3742 0.0028 -0.2308 -0.2601 0.1172 -0.0657 -0.3106 -0.0735 0.1766 0.0001 -0.0044 -0.1972 -0.1851 -0.1555 -0.1605 -0.1691 0.1023 0.0920 0.0989 0.1008 0.0922 0.1005 0.0912 0.0955 0.1259 0.0961 0.0899 0.0954 0.0756 0.1052 0.1000 0.1159 0.1209 0.1643 0.1982 0.1090 0.1042 0.1436 0.1429 0.1603 0.1601 0.1614
va: 2.1133 1.9887 2.2530 3.7015 3.8151 3.7970 3.9148 3.8842 3.8972 4.1474 3.6809 3.9290 3.9500 3.8041 3.6948 3.9842 3.9404 3.6837 3.8111 3.6276 3.9248 3.9194 3.8862 3.8928 3.8853 1.0251 1.0337 1.0024 0.9987 1.0009 0.9993 1.0186 1.0008 1.0031 0.9957 1.0062 0.9965 1.0110 1.0009 0.9961 1.0110 0.9925 0.9997 0.9801 1.0073 1.0056 1.0024 1.0037 0.9897 0.9900 0.9890
dispcorr: -0.023578985 hartree
energy: -1079.762256525470
dipole: 21.98399 -21.86286 0.12113 6.86596 -7.42858 -0.56261 -8.89327 8.19259 -0.70068
magnitude: 0.90673 au
magnitude: 2.30472 debye
