program: Orca
programVersion: 5.0.2
elementType: O O O C C C C C C C C C C C C C C C C C C C C C C H H H H H H H H H H H H H H H H H H H H H H H H H H
charge: 0
multiplicity: 1
keywords: wb97x-d3
keywords: def2-TZVPP
keywords: def2/J RIJCOSX
keywords: DEFGRID2
keywords: scfconv7
keywords: smallprint printgap noloewdin
keywords: NOSOSCF
formula: C22H26O3
InChI: InChI=1/C22H26O3/c1-15(2)10-19-20(22(19,3)4)21(23)25-14-17-12-18(24-13-17)11-16-8-6-5-7-9-16/h5-10,12-13,19-20H,11,14H2,1-4H3
51 atoms
O  0.776924 -0.781162 -1.639863
O  0.959917 1.301217 -0.838989
O  -1.225295 -1.540006 1.960462
C  3.818363 0.167866 -0.081777
C  3.916018 1.148798 -1.211087
C  2.924715 0.012214 -1.30351
C  4.900469 -0.870816 0.082476
C  3.24401 0.630998 1.233325
C  5.065971 1.160306 -2.140556
C  1.478379 0.278709 -1.225378
C  5.898298 2.183303 -2.355673
C  7.026536 2.05908 -3.333869
C  5.808816 3.507572 -1.662271
C  -0.647461 -0.715187 -1.570333
C  -1.134338 -0.99734 -0.191854
C  -2.498022 -0.953161 0.244914
C  -0.408272 -1.360292 0.888684
C  -2.495121 -1.292112 1.55617
C  -3.572128 -1.456651 2.569755
C  -4.884258 -0.918548 2.071069
C  -5.120929 0.454374 2.061801
C  -5.869863 -1.772928 1.589095
C  -6.320075 0.961986 1.584227
C  -7.072962 -1.268259 1.110588
C  -7.301022 0.100353 1.106987
H  3.469925 2.114703 -0.996907
H  3.19825 -0.810076 -1.956107
H  4.533109 -1.723035 0.656825
H  5.747975 -0.446742 0.625459
H  5.271971 -1.248583 -0.869221
H  2.730209 -0.185789 1.74539
H  2.544914 1.458296 1.132643
H  4.052424 0.967291 1.885224
H  5.242865 0.240658 -2.691272
H  7.990914 2.208016 -2.841177
H  7.043573 1.084061 -3.82028
H  6.957536 2.823986 -4.111676
H  4.981329 3.576776 -0.959186
H  6.728898 3.709365 -1.107867
H  5.703948 4.319271 -2.386104
H  -1.003791 -1.474386 -2.268234
H  -1.014872 0.249306 -1.929246
H  -3.361513 -0.698215 -0.349417
H  0.644657 -1.522874 1.059974
H  -3.283052 -0.94528 3.492384
H  -3.677241 -2.51547 2.824509
H  -4.360158 1.131475 2.432918
H  -5.697316 -2.842737 1.590601
H  -6.489689 2.031006 1.586046
H  -7.832315 -1.946187 0.742535
H  -8.237935 0.495311 0.73625
elementType: O C H
totalener: -1079.74065275 hartree
nucrepener: 2035.87021248 hartree
electener: -3115.61086523 hartree
oneelecener: -5510.92303524 hartree
twoeener: 2395.31217001 hartree
cpcmener: -0.03152335 hartree
kineticenergy: 1074.84263137 hartree
xcener: -106.462509277319 hartree
chargesum: -0.0000000
charge: -0.294901 -0.490934 -0.293865 0.129382 0.031818 -0.110448 -0.264380 -0.288299 -0.289864 0.387100 -0.040183 -0.222235 -0.251951 0.107174 -0.047678 -0.321887 -0.065669 0.188600 -0.005978 -0.001854 -0.204483 -0.181975 -0.153367 -0.159882 -0.170074 0.093630 0.093211 0.098700 0.096991 0.089492 0.094726 0.095179 0.101600 0.123209 0.093515 0.089229 0.094141 0.090291 0.096468 0.096268 0.125749 0.116589 0.163185 0.179043 0.111062 0.103700 0.145394 0.142626 0.160549 0.160343 0.160943
qa: -0.2949 -0.4909 -0.2939 0.1294 0.0318 -0.1104 -0.2644 -0.2883 -0.2899 0.3871 -0.0402 -0.2222 -0.2520 0.1072 -0.0477 -0.3219 -0.0657 0.1886 -0.0060 -0.0019 -0.2045 -0.1820 -0.1534 -0.1599 -0.1701 0.0936 0.0932 0.0987 0.0970 0.0895 0.0947 0.0952 0.1016 0.1232 0.0935 0.0892 0.0941 0.0903 0.0965 0.0963 0.1257 0.1166 0.1632 0.1790 0.1111 0.1037 0.1454 0.1426 0.1605 0.1603 0.1609
va: 2.1190 1.9993 2.2563 3.6710 3.7776 3.8626 3.9013 3.8969 3.8704 4.1712 3.7349 3.9219 3.9426 3.8186 3.6769 3.9868 3.9484 3.6653 3.8093 3.6245 3.9270 3.9196 3.8844 3.8914 3.8879 1.0322 1.0379 1.0023 1.0025 1.0042 1.0025 1.0162 1.0024 1.0077 0.9964 1.0083 0.9959 1.0085 0.9972 0.9971 0.9916 1.0114 1.0003 0.9924 1.0066 1.0066 1.0017 1.0037 0.9898 0.9899 0.9893
dispcorr: -0.022564248 hartree
energy: -1079.763216996432
dipole: 29.82177 -29.45295 0.36883 8.94100 -9.66176 -0.72076 -5.29429 5.00630 -0.28800
magnitude: 0.85935 au
magnitude: 2.18428 debye
