program: Orca
programVersion: 5.0.2
elementType: O O O C C C C C C C C C C C C C C C C C C C C C C H H H H H H H H H H H H H H H H H H H H H H H H H H
charge: 0
multiplicity: 1
keywords: wb97x-d3
keywords: def2-TZVPP
keywords: def2/J RIJCOSX
keywords: DEFGRID2
keywords: scfconv7
keywords: smallprint printgap noloewdin
keywords: NOSOSCF
formula: C22H26O3
InChI: InChI=1/C22H26O3/c1-15(2)10-19-20(22(19,3)4)21(23)25-14-17-12-18(24-13-17)11-16-8-6-5-7-9-16/h5-10,12-13,19-20H,11,14H2,1-4H3
51 atoms
O  1.671367 -2.190731 -0.214875
O  1.000847 -1.085038 -2.044422
O  -2.165255 -3.290471 1.513134
C  1.410015 1.292626 0.006832
C  2.43923 1.343397 -1.085221
C  2.224958 0.05167 -0.33159
C  1.698629 1.927626 1.345359
C  -0.047406 1.379682 -0.378136
C  3.722558 2.057143 -0.930246
C  1.573365 -1.101279 -0.977153
C  4.257175 2.928335 -1.792207
C  5.580211 3.573763 -1.506907
C  3.63193 3.344736 -3.088479
C  0.859486 -3.335843 -0.538761
C  -0.491971 -3.166578 0.058462
C  -1.543683 -2.288521 -0.361948
C  -0.931936 -3.746202 1.19985
C  -2.529691 -2.395874 0.559199
C  -3.819082 -1.670644 0.734018
C  -3.581921 -0.215904 1.065873
C  -2.990792 0.144394 2.2761
C  -3.909115 0.784222 0.157144
C  -2.734299 1.475422 2.569135
C  -3.654524 2.11967 0.448771
C  -3.066338 2.469077 1.65519
H  2.014608 1.351258 -2.083235
H  2.971954 -0.208083 0.41071
H  1.500136 3.000617 1.308846
H  2.729065 1.789083 1.669489
H  1.051642 1.500066 2.11385
H  -0.67018 0.809032 0.314827
H  -0.248301 1.02539 -1.386745
H  -0.372845 2.420472 -0.33015
H  4.279571 1.842086 -0.022642
H  6.013841 3.229069 -0.568383
H  6.297119 3.367771 -2.305962
H  5.482514 4.661237 -1.455069
H  3.548167 4.433392 -3.136434
H  4.261977 3.048862 -3.931508
H  2.639062 2.931125 -3.254466
H  1.373049 -4.185485 -0.092724
H  0.821845 -3.491933 -1.616518
H  -1.560664 -1.646812 -1.227953
H  -0.494481 -4.472658 1.867114
H  -4.401887 -2.149492 1.523664
H  -4.40836 -1.746452 -0.18125
H  -2.727139 -0.622664 2.995257
H  -4.367818 0.518512 -0.78793
H  -2.274417 1.738866 3.513046
H  -3.916049 2.885507 -0.26997
H  -2.8653 3.507767 1.883048
elementType: O C H
totalener: -1079.73935014 hartree
nucrepener: 2172.66136134 hartree
electener: -3252.40071148 hartree
oneelecener: -5784.87553648 hartree
twoeener: 2532.47482500 hartree
cpcmener: -0.02934045 hartree
kineticenergy: 1074.84618471 hartree
xcener: -106.461095060520 hartree
chargesum: -0.0000000
charge: -0.286961 -0.494880 -0.281333 0.168884 0.032771 -0.110894 -0.279301 -0.307691 -0.288756 0.416626 -0.045931 -0.220926 -0.254535 0.075173 -0.075653 -0.347078 -0.035566 0.237814 -0.034076 -0.014641 -0.163148 -0.165619 -0.169682 -0.165210 -0.170741 0.091336 0.092217 0.098347 0.092561 0.095635 0.063215 0.103681 0.106453 0.120881 0.089139 0.093141 0.094120 0.094873 0.098538 0.090542 0.118577 0.119956 0.162206 0.180037 0.110732 0.104803 0.140866 0.142049 0.159213 0.158718 0.159519
qa: -0.2870 -0.4949 -0.2813 0.1689 0.0328 -0.1109 -0.2793 -0.3077 -0.2888 0.4166 -0.0459 -0.2209 -0.2545 0.0752 -0.0757 -0.3471 -0.0356 0.2378 -0.0341 -0.0146 -0.1631 -0.1656 -0.1697 -0.1652 -0.1707 0.0913 0.0922 0.0983 0.0926 0.0956 0.0632 0.1037 0.1065 0.1209 0.0891 0.0931 0.0941 0.0949 0.0985 0.0905 0.1186 0.1200 0.1622 0.1800 0.1107 0.1048 0.1409 0.1420 0.1592 0.1587 0.1595
va: 2.1144 2.0044 2.2718 3.6170 3.7878 3.8529 3.9058 3.9124 3.8743 4.1718 3.7514 3.9207 3.9419 3.8371 3.6997 3.9449 3.9541 3.6142 3.7933 3.6751 3.8704 3.8789 3.8666 3.8683 3.8450 1.0325 1.0372 1.0016 1.0067 1.0025 1.0064 1.0191 0.9995 1.0101 1.0086 0.9958 0.9965 0.9975 0.9961 1.0096 0.9975 1.0102 1.0158 0.9922 1.0139 1.0082 1.0096 1.0026 0.9911 0.9911 0.9907
dispcorr: -0.026355381 hartree
energy: -1079.765705525692
dipole: 15.50468 -15.38288 0.12180 23.54187 -23.25005 0.29182 -4.46147 5.25108 0.78962
magnitude: 0.85058 au
magnitude: 2.16201 debye
