program: Orca
programVersion: 5.0.2
elementType: O O O C C C C C C C C C C C C C C C C C C C C C C H H H H H H H H H H H H H H H H H H H H H H H H H H
charge: 0
multiplicity: 1
keywords: wb97x-d3
keywords: def2-TZVPP
keywords: def2/J RIJCOSX
keywords: DEFGRID2
keywords: scfconv7
keywords: smallprint printgap noloewdin
keywords: NOSOSCF
formula: C22H26O3
InChI: InChI=1/C22H26O3/c1-15(2)10-19-20(22(19,3)4)21(23)25-14-17-12-18(24-13-17)11-16-8-6-5-7-9-16/h5-10,12-13,19-20H,11,14H2,1-4H3
51 atoms
O  1.845802 -2.159399 -0.889456
O  2.244258 -1.690443 1.262443
O  -2.514202 -2.328445 -0.782644
C  4.103261 0.57362 0.113586
C  2.749557 1.119488 0.393337
C  2.887306 -0.143881 -0.448756
C  4.959558 1.258215 -0.924548
C  4.90652 -0.030273 1.238571
C  2.203271 2.353948 -0.220868
C  2.321194 -1.388769 0.090834
C  0.917727 2.479491 -0.562429
C  0.365766 3.750036 -1.127101
C  -0.053658 1.343342 -0.3935
C  1.007272 -3.276163 -0.540157
C  -0.394563 -2.820158 -0.338619
C  -0.972615 -2.164102 0.799006
C  -1.381547 -2.885744 -1.262568
C  -2.256876 -1.885063 0.475562
C  -3.349785 -1.177822 1.19531
C  -3.459876 0.274595 0.79012
C  -3.941991 0.633113 -0.467464
C  -3.05351 1.280173 1.661513
C  -4.006605 1.966349 -0.846466
C  -3.120343 2.616044 1.286235
C  -3.593772 2.963275 0.028888
H  2.384058 0.913398 1.397651
H  2.739519 -0.015033 -1.51464
H  5.510377 2.088745 -0.479782
H  4.372314 1.653487 -1.753246
H  5.690421 0.561816 -1.339183
H  5.542636 -0.840184 0.876421
H  4.289743 -0.419677 2.045141
H  5.561205 0.730885 1.668195
H  2.878935 3.193557 -0.35758
H  -0.437572 4.136979 -0.494452
H  1.125962 4.524932 -1.22272
H  -0.075943 3.581129 -2.112118
H  -0.120269 1.018804 0.646912
H  -1.056104 1.621339 -0.717016
H  0.244361 0.468546 -0.975669
H  1.399993 -3.799226 0.330783
H  1.068437 -3.949565 -1.392417
H  -0.495031 -1.930032 1.73644
H  -1.422116 -3.295828 -2.259967
H  -3.146821 -1.243807 2.26451
H  -4.299486 -1.690609 1.021519
H  -4.275566 -0.132856 -1.157215
H  -2.677369 1.016613 2.643006
H  -4.382976 2.227653 -1.827264
H  -2.799204 3.385006 1.976877
H  -3.644478 4.002984 -0.267343
elementType: O C H
totalener: -1079.73757105 hartree
nucrepener: 2218.69993287 hartree
electener: -3298.43750392 hartree
oneelecener: -5876.97232367 hartree
twoeener: 2578.53481974 hartree
cpcmener: -0.02728879 hartree
kineticenergy: 1074.86004482 hartree
xcener: -106.464149528284 hartree
chargesum: 0.0000000
charge: -0.294506 -0.507060 -0.285790 0.161357 0.013938 -0.110405 -0.285790 -0.282199 -0.360390 0.408044 0.069140 -0.236835 -0.307194 0.073476 -0.071519 -0.353097 -0.033086 0.243491 -0.046543 0.035176 -0.197681 -0.222637 -0.128501 -0.116622 -0.212881 0.103199 0.097327 0.099963 0.092346 0.098193 0.099880 0.090429 0.094608 0.123566 0.094794 0.092853 0.102543 0.106259 0.083264 0.112463 0.118635 0.120942 0.161238 0.178053 0.102579 0.117232 0.139321 0.141175 0.158405 0.158913 0.159935
qa: -0.2945 -0.5071 -0.2858 0.1614 0.0139 -0.1104 -0.2858 -0.2822 -0.3604 0.4080 0.0691 -0.2368 -0.3072 0.0735 -0.0715 -0.3531 -0.0331 0.2435 -0.0465 0.0352 -0.1977 -0.2226 -0.1285 -0.1166 -0.2129 0.1032 0.0973 0.1000 0.0923 0.0982 0.0999 0.0904 0.0946 0.1236 0.0948 0.0929 0.1025 0.1063 0.0833 0.1125 0.1186 0.1209 0.1612 0.1781 0.1026 0.1172 0.1393 0.1412 0.1584 0.1589 0.1599
va: 2.0986 1.9883 2.2667 3.7152 3.7831 3.8118 3.9093 3.8857 3.9101 4.1229 3.6301 3.9132 3.9712 3.8436 3.6445 3.9576 3.9627 3.5844 3.7994 3.5944 3.9344 3.8969 3.8559 3.8025 3.8765 1.0271 1.0328 0.9998 1.0024 1.0029 0.9990 1.0196 1.0007 1.0046 0.9946 1.0090 0.9937 0.9925 1.0173 1.0042 1.0107 0.9971 1.0201 0.9932 1.0133 1.0066 1.0154 1.0044 0.9904 0.9895 0.9911
dispcorr: -0.028690424 hartree
energy: -1079.766261475749
dipole: 13.04050 -13.31793 -0.27743 16.52591 -16.15608 0.36983 -1.44158 0.68355 -0.75803
magnitude: 0.88789 au
magnitude: 2.25684 debye
