program: Orca
programVersion: 5.0.2
elementType: O O O C C C C C C C C C C C C C C C C C C C C C C H H H H H H H H H H H H H H H H H H H H H H H H H H
charge: 0
multiplicity: 1
keywords: wb97x-d3
keywords: def2-TZVPP
keywords: def2/J RIJCOSX
keywords: DEFGRID2
keywords: scfconv7
keywords: smallprint printgap noloewdin
keywords: NOSOSCF
formula: C22H26O3
InChI: InChI=1/C22H26O3/c1-15(2)10-19-20(22(19,3)4)21(23)25-14-17-12-18(24-13-17)11-16-8-6-5-7-9-16/h5-10,12-13,19-20H,11,14H2,1-4H3
51 atoms
O  1.956395 -2.21885 -0.752092
O  2.105445 -1.633553 1.402044
O  -2.323891 -2.061232 -0.910203
C  3.953756 0.687714 0.337049
C  2.544803 1.154702 0.431788
C  2.855796 -0.13715 -0.311797
C  4.878986 1.374015 -0.63935
C  4.658148 0.198215 1.577907
C  2.003595 2.315742 -0.317801
C  2.296605 -1.383502 0.231449
C  0.804083 2.31589 -0.90645
C  0.284576 3.514666 -1.636824
C  -0.093104 1.109566 -0.902559
C  1.074303 -3.315062 -0.444051
C  -0.323104 -2.818584 -0.315053
C  -1.007738 -2.338389 0.850196
C  -1.176402 -2.620391 -1.347494
C  -2.214981 -1.889826 0.433616
C  -3.346233 -1.219869 1.127109
C  -3.405542 0.251618 0.790328
C  -2.78566 1.186947 1.613938
C  -4.035165 0.692466 -0.370808
C  -2.793216 2.536103 1.286957
C  -4.041429 2.040845 -0.702609
C  -3.419521 2.967085 0.124754
H  2.084703 0.983054 1.403108
H  2.820626 -0.073123 -1.3930
H  5.324648 2.26162 -0.186198
H  4.366294 1.686758 -1.549049
H  5.693289 0.70822 -0.930295
H  5.209466 1.022988 2.033346
H  5.380729 -0.582797 1.334743
H  3.977948 -0.19292 2.330828
H  2.6169 3.211554 -0.361716
H  0.039335 3.26498 -2.672308
H  -0.641393 3.875244 -1.180784
H  1.001437 4.335485 -1.645902
H  -1.132472 1.391118 -1.075545
H  0.183454 0.415592 -1.701652
H  -0.047934 0.555857 0.035302
H  1.407819 -3.849168 0.44499
H  1.166552 -3.986204 -1.295416
H  -0.646082 -2.327823 1.865912
H  -1.102646 -2.828769 -2.40393
H  -3.207887 -1.352021 2.200457
H  -4.289461 -1.70488 0.862573
H  -2.291218 0.854585 2.51921
H  -4.530179 -0.020526 -1.019514
H  -2.309659 3.25081 1.940315
H  -4.535762 2.368978 -1.608029
H  -3.427408 4.018376 -0.132284
elementType: O C H
totalener: -1079.73800326 hartree
nucrepener: 2239.25779093 hartree
electener: -3318.99579419 hartree
oneelecener: -5918.23338716 hartree
twoeener: 2599.23759297 hartree
cpcmener: -0.02772381 hartree
kineticenergy: 1074.85880992 hartree
xcener: -106.463609623068 hartree
chargesum: 0.0000000
charge: -0.294492 -0.503629 -0.281987 0.162729 0.008752 -0.079918 -0.285476 -0.283005 -0.346359 0.375920 0.040975 -0.227689 -0.273606 0.076924 -0.073956 -0.311825 -0.037362 0.193498 -0.041701 0.072001 -0.238443 -0.204805 -0.119808 -0.124847 -0.221421 0.100947 0.093326 0.099026 0.092707 0.098252 0.094217 0.100000 0.088967 0.123624 0.102777 0.091794 0.091596 0.085396 0.114951 0.081709 0.118469 0.123169 0.156880 0.175566 0.106278 0.117068 0.141410 0.141031 0.160066 0.158626 0.161679
qa: -0.2945 -0.5036 -0.2820 0.1627 0.0088 -0.0799 -0.2855 -0.2830 -0.3464 0.3759 0.0410 -0.2277 -0.2736 0.0769 -0.0740 -0.3118 -0.0374 0.1935 -0.0417 0.0720 -0.2384 -0.2048 -0.1198 -0.1248 -0.2214 0.1009 0.0933 0.0990 0.0927 0.0983 0.0942 0.1000 0.0890 0.1236 0.1028 0.0918 0.0916 0.0854 0.1150 0.0817 0.1185 0.1232 0.1569 0.1756 0.1063 0.1171 0.1414 0.1410 0.1601 0.1586 0.1617
va: 2.1007 1.9886 2.2576 3.7048 3.7782 3.8177 3.9073 3.8861 3.9134 4.1507 3.6654 3.9208 3.9594 3.8391 3.6323 3.9577 3.9376 3.6265 3.8038 3.5399 3.9065 3.9465 3.7943 3.8449 3.8781 1.0262 1.0349 1.0001 1.0021 1.0028 1.0008 0.9989 1.0201 1.0049 0.9947 0.9954 1.0074 1.0119 1.0031 1.0005 1.0086 0.9962 1.0183 0.9939 1.0128 1.0056 1.0048 1.0108 0.9890 0.9900 0.9903
dispcorr: -0.029436895 hartree
energy: -1079.767440156560
dipole: 12.21533 -12.43438 -0.21906 15.96042 -15.68122 0.27920 -2.38340 1.52244 -0.86096
magnitude: 0.93123 au
magnitude: 2.36700 debye
