program: Orca
programVersion: 5.0.2
elementType: O O O C C C C C C C C C C C C C C C C C C C C C C H H H H H H H H H H H H H H H H H H H H H H H H H H
charge: 0
multiplicity: 1
keywords: wb97x-d3
keywords: def2-TZVPP
keywords: def2/J RIJCOSX
keywords: DEFGRID2
keywords: scfconv7
keywords: smallprint printgap noloewdin
keywords: NOSOSCF
formula: C22H26O3
InChI: InChI=1/C22H26O3/c1-15(2)10-19-20(22(19,3)4)21(23)25-14-17-12-18(24-13-17)11-16-8-6-5-7-9-16/h5-10,12-13,19-20H,11,14H2,1-4H3
51 atoms
O  1.618558 -1.839385 -0.590778
O  2.459871 -0.96225 1.287523
O  -1.84389 -0.189876 1.672115
C  4.888248 -0.259544 -0.603863
C  4.027186 0.938544 -0.414163
C  3.388507 -0.373711 -0.840131
C  5.734469 -0.366814 -1.849255
C  5.529412 -0.902087 0.600794
C  4.028727 2.089665 -1.353141
C  2.474236 -1.066217 0.080156
C  2.961323 2.844229 -1.62773
C  3.045966 4.001855 -2.573962
C  1.607305 2.602377 -1.034715
C  0.567075 -2.483915 0.147336
C  -0.506985 -1.520517 0.503161
C  -1.40767 -0.856929 -0.394021
C  -0.8197 -1.069658 1.73893
C  -2.196262 -0.062964 0.36665
C  -3.339879 0.832937 0.052737
C  -4.654665 0.252017 0.516089
C  -5.459326 -0.462486 -0.366618
C  -5.06621 0.386879 1.839822
C  -6.651501 -1.031016 0.061956
C  -6.254561 -0.185659 2.272436
C  -7.050679 -0.898243 1.385115
H  3.836689 1.191523 0.626312
H  3.102408 -0.439703 -1.883469
H  6.682548 0.157699 -1.715036
H  5.243258 0.05064 -2.728064
H  5.963977 -1.411743 -2.06477
H  5.639082 -1.978961 0.460057
H  4.976337 -0.735676 1.522187
H  6.529146 -0.48769 0.743588
H  4.973838 2.336528 -1.828874
H  2.789473 4.938013 -2.071527
H  4.041795 4.111033 -3.002811
H  2.333515 3.888097 -3.394913
H  0.88506 2.348045 -1.815122
H  1.593895 1.803317 -0.295459
H  1.23133 3.50854 -0.55341
H  0.962428 -2.982626 1.032924
H  0.19366 -3.250773 -0.529537
H  -1.462584 -0.967798 -1.465863
H  -0.418144 -1.275983 2.71876
H  -3.358841 0.984577 -1.026849
H  -3.180976 1.81354 0.509585
H  -5.151581 -0.57289 -1.39988
H  -4.457469 0.948393 2.538494
H  -7.268238 -1.578893 -0.638854
H  -6.560267 -0.073135 3.304695
H  -7.978268 -1.342868 1.721456
elementType: O C H
totalener: -1079.73978457 hartree
nucrepener: 2083.40838860 hartree
electener: -3163.14817317 hartree
oneelecener: -5606.32979356 hartree
twoeener: 2443.18162039 hartree
cpcmener: -0.03001512 hartree
kineticenergy: 1074.85957516 hartree
xcener: -106.461111989882 hartree
chargesum: 0.0000000
charge: -0.290877 -0.507347 -0.288387 0.155163 -0.017984 -0.096440 -0.286720 -0.280543 -0.303554 0.403512 -0.008971 -0.229932 -0.240691 0.095548 -0.069129 -0.361851 -0.025617 0.218438 -0.054131 0.058910 -0.206661 -0.205013 -0.150560 -0.160060 -0.179606 0.102305 0.092301 0.099103 0.092893 0.097863 0.100834 0.089899 0.095448 0.125348 0.096742 0.090472 0.094967 0.099690 0.077200 0.102323 0.119211 0.123609 0.162005 0.177792 0.106883 0.118526 0.143706 0.142099 0.159896 0.160180 0.161212
qa: -0.2909 -0.5073 -0.2884 0.1552 -0.0180 -0.0964 -0.2867 -0.2805 -0.3036 0.4035 -0.0090 -0.2299 -0.2407 0.0955 -0.0691 -0.3619 -0.0256 0.2184 -0.0541 0.0589 -0.2067 -0.2050 -0.1506 -0.1601 -0.1796 0.1023 0.0923 0.0991 0.0929 0.0979 0.1008 0.0899 0.0954 0.1253 0.0967 0.0905 0.0950 0.0997 0.0772 0.1023 0.1192 0.1236 0.1620 0.1778 0.1069 0.1185 0.1437 0.1421 0.1599 0.1602 0.1612
va: 2.1089 1.9878 2.2661 3.6934 3.8198 3.8035 3.9116 3.8897 3.8931 4.1310 3.7066 3.9295 3.9424 3.8204 3.6074 3.9936 3.9546 3.6078 3.8129 3.5764 3.9405 3.9524 3.8807 3.8944 3.8978 1.0262 1.0329 0.9996 1.0013 1.0027 0.9987 1.0191 1.0011 1.0028 0.9962 1.0059 0.9963 0.9985 1.0107 0.9999 1.0093 0.9910 1.0086 0.9971 1.0108 1.0051 1.0032 1.0111 0.9898 0.9900 0.9894
dispcorr: -0.023252142 hartree
energy: -1079.763036708537
dipole: 20.21858 -20.39275 -0.17417 10.82563 -10.71576 0.10987 -11.13107 9.75131 -1.37976
magnitude: 1.39504 au
magnitude: 3.54592 debye
