program: Orca
programVersion: 5.0.2
elementType: O O O C C C C C C C C C C C C C C C C C C C C C C H H H H H H H H H H H H H H H H H H H H H H H H H H
charge: 0
multiplicity: 1
keywords: wb97x-d3
keywords: def2-TZVPP
keywords: def2/J RIJCOSX
keywords: DEFGRID2
keywords: scfconv7
keywords: smallprint printgap noloewdin
keywords: NOSOSCF
formula: C22H26O3
InChI: InChI=1/C22H26O3/c1-15(2)10-19-20(22(19,3)4)21(23)25-14-17-12-18(24-13-17)11-16-8-6-5-7-9-16/h5-10,12-13,19-20H,11,14H2,1-4H3
51 atoms
O  1.699059 -2.046764 -0.696902
O  2.519846 -1.350712 1.263746
O  -1.752481 -0.416754 1.560786
C  4.850038 -0.159863 -0.476331
C  3.813727 0.883978 -0.254121
C  3.396701 -0.479972 -0.787538
C  5.742012 -0.053598 -1.689976
C  5.544854 -0.775305 0.712744
C  3.670063 2.085366 -1.115049
C  2.530624 -1.318707 0.052403
C  2.500545 2.626863 -1.466581
C  2.431337 3.846262 -2.333032
C  1.176084 2.055727 -1.055706
C  0.612164 -2.714195 -0.033632
C  -0.430763 -1.72942 0.354476
C  -1.209797 -0.911057 -0.528629
C  -0.800417 -1.376702 1.60584
C  -1.990859 -0.132558 0.254663
C  -3.022548 0.894598 -0.041774
C  -4.386152 0.477932 0.451919
C  -5.210482 -0.314429 -0.34208
C  -4.823783 0.840958 1.721775
C  -6.448754 -0.734571 0.122891
C  -6.061147 0.419866 2.191065
C  -6.87709 -0.36996 1.39285
H  3.547147 1.03164 0.790277
H  3.157577 -0.513223 -1.844096
H  6.139877 -1.033943 -1.957749
H  6.590993 0.601923 -1.486551
H  5.218784 0.339416 -2.561619
H  4.949935 -0.744058 1.622148
H  6.470622 -0.231958 0.911609
H  5.812641 -1.815101 0.516655
H  4.586746 2.555928 -1.460203
H  1.923324 4.664502 -1.816771
H  3.419336 4.195688 -2.632054
H  1.853309 3.648789 -3.239652
H  0.486329 2.849059 -0.760442
H  0.706231 1.533416 -1.89384
H  1.248491 1.353378 -0.227265
H  0.964146 -3.285636 0.825915
H  0.234784 -3.418989 -0.772843
H  -1.189908 -0.908967 -1.60735
H  -0.48922 -1.708615 2.583997
H  -3.039297 1.045031 -1.121807
H  -2.740083 1.850244 0.408633
H  -4.880827 -0.603365 -1.333298
H  -4.194847 1.462766 2.347795
H  -7.081103 -1.346094 -0.50784
H  -6.388056 0.710781 3.181048
H  -7.842548 -0.696936 1.756306
elementType: O C H
totalener: -1079.73935221 hartree
nucrepener: 2114.17396123 hartree
electener: -3193.91331344 hartree
oneelecener: -5667.79668864 hartree
twoeener: 2473.88337520 hartree
cpcmener: -0.03028740 hartree
kineticenergy: 1074.87056484 hartree
xcener: -106.463855862238 hartree
chargesum: 0.0000000
charge: -0.291524 -0.503234 -0.289613 0.160877 -0.010765 -0.087847 -0.285267 -0.283473 -0.316298 0.380681 0.008383 -0.228927 -0.259024 0.098707 -0.057327 -0.400882 -0.024684 0.225658 -0.037854 0.063087 -0.208936 -0.202572 -0.157628 -0.162844 -0.173840 0.103982 0.091674 0.097807 0.099082 0.093612 0.090042 0.094631 0.100266 0.123921 0.096999 0.089669 0.095448 0.103863 0.106410 0.083889 0.117867 0.122905 0.161175 0.178343 0.112082 0.115244 0.144022 0.142532 0.159416 0.159431 0.160835
qa: -0.2915 -0.5032 -0.2896 0.1609 -0.0108 -0.0878 -0.2853 -0.2835 -0.3163 0.3807 0.0084 -0.2289 -0.2590 0.0987 -0.0573 -0.4009 -0.0247 0.2257 -0.0379 0.0631 -0.2089 -0.2026 -0.1576 -0.1628 -0.1738 0.1040 0.0917 0.0978 0.0991 0.0936 0.0900 0.0946 0.1003 0.1239 0.0970 0.0897 0.0954 0.1039 0.1064 0.0839 0.1179 0.1229 0.1612 0.1783 0.1121 0.1152 0.1440 0.1425 0.1594 0.1594 0.1608
va: 2.1019 1.9899 2.2658 3.6879 3.8041 3.8029 3.9097 3.8870 3.9056 4.1550 3.7103 3.9311 3.9453 3.8276 3.5974 3.9759 3.9622 3.5918 3.7879 3.5646 3.9401 3.9487 3.8895 3.8946 3.8915 1.0259 1.0334 1.0029 0.9999 1.0015 1.0198 1.0007 0.9988 1.0036 0.9961 1.0061 0.9955 1.0004 0.9946 1.0006 1.0098 0.9908 1.0107 0.9958 1.0088 1.0041 1.0035 1.0070 0.9902 0.9903 0.9894
dispcorr: -0.024657773 hartree
energy: -1079.764009984085
dipole: 18.36235 -18.58631 -0.22396 11.67785 -11.35236 0.32549 -10.22570 8.80317 -1.42253
magnitude: 1.47638 au
magnitude: 3.75266 debye
