program: Orca
programVersion: 5.0.2
elementType: O O O C C C C C C C C C C C C C C C C C C C C C C H H H H H H H H H H H H H H H H H H H H H H H H H H
charge: 0
multiplicity: 1
keywords: wb97x-d3
keywords: def2-TZVPP
keywords: def2/J RIJCOSX
keywords: DEFGRID2
keywords: scfconv7
keywords: smallprint printgap noloewdin
keywords: NOSOSCF
formula: C22H26O3
InChI: InChI=1/C22H26O3/c1-15(2)10-19-20(22(19,3)4)21(23)25-14-17-12-18(24-13-17)11-16-8-6-5-7-9-16/h5-10,12-13,19-20H,11,14H2,1-4H3
51 atoms
O  1.706473 -1.909986 -0.567669
O  1.978489 -1.711139 1.642939
O  -2.526669 -2.483767 -0.625121
C  1.322788 1.192876 -0.189268
C  2.497874 0.836655 -1.052782
C  2.358946 0.186173 0.296883
C  1.311906 2.522407 0.523112
C  -0.054421 0.739135 -0.610319
C  3.620041 1.785917 -1.277073
C  2.002546 -1.226385 0.531385
C  3.668525 2.684322 -2.264424
C  4.843954 3.596811 -2.434778
C  2.573975 2.862203 -3.270717
C  1.049615 -3.188491 -0.432215
C  -0.401769 -2.96875 -0.19916
C  -1.06196 -2.642254 1.030036
C  -1.345313 -2.858117 -1.163901
C  -2.343179 -2.344191 0.71344
C  -3.457944 -1.758418 1.504253
C  -3.343772 -0.251053 1.487173
C  -2.656819 0.40904 2.502144
C  -3.839154 0.490966 0.41818
C  -2.464197 1.783141 2.450896
C  -3.647122 1.865403 0.363989
C  -2.956208 2.515358 1.378257
H  2.247368 0.208795 -1.902819
H  3.007594 0.569709 1.078024
H  0.978266 3.312947 -0.153027
H  2.292797 2.803637 0.904998
H  0.61895 2.498343 1.367167
H  -0.551808 1.546172 -1.152185
H  -0.673111 0.499542 0.2574
H  -0.040287 -0.127281 -1.26848
H  4.452189 1.738209 -0.580285
H  5.597669 3.446188 -1.662141
H  5.321143 3.445351 -3.406382
H  4.533204 4.644266 -2.405232
H  2.190493 3.885188 -3.242359
H  2.950153 2.704668 -4.284811
H  1.733291 2.187542 -3.115909
H  1.515587 -3.781708 0.353781
H  1.220832 -3.689684 -1.382732
H  -0.633206 -2.611385 2.018574
H  -1.321801 -3.011082 -2.231779
H  -3.392963 -2.125681 2.52886
H  -4.421658 -2.078963 1.103545
H  -2.26339 -0.1590 3.337089
H  -4.377785 -0.007382 -0.37922
H  -1.928475 2.281612 3.248585
H  -4.037024 2.429398 -0.473644
H  -2.805325 3.586113 1.334804
elementType: O C H
totalener: -1079.73596703 hartree
nucrepener: 2217.93740744 hartree
electener: -3297.67337447 hartree
oneelecener: -5875.26302310 hartree
twoeener: 2577.58964862 hartree
cpcmener: -0.02992936 hartree
kineticenergy: 1074.85430896 hartree
xcener: -106.462219503620 hartree
chargesum: -0.0000000
charge: -0.278639 -0.499172 -0.278673 0.208178 0.011140 -0.133212 -0.298565 -0.329612 -0.282461 0.421946 -0.036712 -0.230362 -0.250518 0.054335 -0.075901 -0.314696 -0.034445 0.204751 -0.043290 0.040217 -0.166564 -0.204070 -0.173461 -0.155100 -0.174044 0.107691 0.096434 0.098942 0.097369 0.096552 0.108937 0.058902 0.103280 0.122029 0.089939 0.095537 0.093831 0.097451 0.102979 0.087462 0.121619 0.120471 0.158966 0.178539 0.108829 0.111331 0.141780 0.140047 0.160137 0.159505 0.160371
qa: -0.2786 -0.4992 -0.2787 0.2082 0.0111 -0.1332 -0.2986 -0.3296 -0.2825 0.4219 -0.0367 -0.2304 -0.2505 0.0543 -0.0759 -0.3147 -0.0344 0.2048 -0.0433 0.0402 -0.1666 -0.2041 -0.1735 -0.1551 -0.1740 0.1077 0.0964 0.0989 0.0974 0.0966 0.1089 0.0589 0.1033 0.1220 0.0899 0.0955 0.0938 0.0975 0.1030 0.0875 0.1216 0.1205 0.1590 0.1785 0.1088 0.1113 0.1418 0.1400 0.1601 0.1595 0.1604
va: 2.1125 1.9919 2.2642 3.5574 3.7897 3.8832 3.9095 3.9222 3.8435 4.1746 3.7097 3.9282 3.9353 3.8555 3.6575 3.9442 3.9350 3.6371 3.8126 3.6040 3.8713 3.9133 3.8620 3.8643 3.8441 1.0176 1.0322 0.9982 1.0045 1.0049 0.9997 1.0107 1.0186 1.0068 1.0071 0.9954 0.9964 0.9978 0.9990 1.0081 1.0082 0.9993 1.0201 0.9932 1.0114 1.0140 1.0029 1.0094 0.9907 0.9901 0.9901
dispcorr: -0.028866998 hartree
energy: -1079.764834030600
dipole: 11.26136 -11.70689 -0.44553 22.49541 -21.82517 0.67023 -9.52552 8.33054 -1.19498
magnitude: 1.44072 au
magnitude: 3.66202 debye
