program: Orca
programVersion: 5.0.2
elementType: O O O C C C C C C C C C C C C C C C C C C C C C C H H H H H H H H H H H H H H H H H H H H H H H H H H
charge: 0
multiplicity: 1
keywords: wb97x-d3
keywords: def2-TZVPP
keywords: def2/J RIJCOSX
keywords: DEFGRID2
keywords: scfconv7
keywords: smallprint printgap noloewdin
keywords: NOSOSCF
formula: C22H26O3
InChI: InChI=1/C22H26O3/c1-15(2)10-19-20(22(19,3)4)21(23)25-14-17-12-18(24-13-17)11-16-8-6-5-7-9-16/h5-10,12-13,19-20H,11,14H2,1-4H3
51 atoms
O  1.640716 -1.754229 -0.635354
O  1.893318 -1.630163 1.583848
O  -2.577073 -2.299558 -0.69593
C  1.200515 1.329374 -0.101866
C  2.345935 1.023706 -1.027006
C  2.259571 0.317402 0.306966
C  1.175949 2.620567 0.679355
C  -0.181411 0.864042 -0.497616
C  3.449801 1.977423 -1.253972
C  1.921028 -1.107754 0.489753
C  3.99501 2.305097 -2.430354
C  5.118978 3.294987 -2.50293
C  3.576037 1.749686 -3.757151
C  0.992786 -3.042176 -0.553204
C  -0.458897 -2.840588 -0.306148
C  -1.120644 -2.614235 0.944078
C  -1.397535 -2.638582 -1.26087
C  -2.397719 -2.277779 0.650556
C  -3.510215 -1.752221 1.485166
C  -3.407586 -0.246122 1.561819
C  -2.696077 0.355416 2.596256
C  -3.939575 0.557061 0.55688
C  -2.515663 1.731667 2.626126
C  -3.759102 1.933908 0.583327
C  -3.044121 2.525423 1.616397
H  2.06511 0.422008 -1.883426
H  2.932357 0.673273 1.080452
H  2.154679 2.908938 1.060059
H  0.504178 2.5292 1.535685
H  0.803593 3.4368 0.05688
H  -0.169323 0.046765 -1.216228
H  -0.725203 1.690052 -0.959666
H  -0.753524 0.543753 0.375983
H  3.854488 2.453734 -0.365309
H  6.001253 2.853036 -2.973562
H  4.842786 4.15655 -3.116328
H  5.410508 3.661636 -1.518904
H  4.400872 1.201533 -4.220625
H  2.720045 1.079871 -3.707248
H  3.321865 2.559245 -4.446132
H  1.464649 -3.665861 0.205181
H  1.165656 -3.499883 -1.525082
H  -0.694376 -2.67386 1.932524
H  -1.370094 -2.697903 -2.337963
H  -3.432925 -2.184199 2.483402
H  -4.475144 -2.054107 1.072921
H  -2.273212 -0.259897 3.381945
H  -4.498385 0.104979 -0.254102
H  -1.960533 2.183896 3.438002
H  -4.17768 2.545575 -0.205573
H  -2.90224 3.598091 1.636296
elementType: O C H
totalener: -1079.73709582 hartree
nucrepener: 2211.29345223 hartree
electener: -3291.03054806 hartree
oneelecener: -5861.98032512 hartree
twoeener: 2570.94977707 hartree
cpcmener: -0.03083245 hartree
kineticenergy: 1074.85396020 hartree
xcener: -106.463698092138 hartree
chargesum: -0.0000000
charge: -0.280920 -0.496811 -0.278016 0.178824 0.051228 -0.107954 -0.299616 -0.304257 -0.302719 0.419188 -0.047352 -0.220533 -0.254328 0.053358 -0.073153 -0.310987 -0.036247 0.198743 -0.043417 0.043786 -0.168183 -0.204230 -0.175942 -0.155985 -0.171860 0.100121 0.092227 0.093440 0.094567 0.098600 0.102111 0.108658 0.056453 0.120202 0.092998 0.093955 0.088344 0.097576 0.089865 0.094874 0.121734 0.121097 0.158767 0.178518 0.109052 0.111734 0.141789 0.140416 0.160533 0.159493 0.160260
qa: -0.2809 -0.4968 -0.2780 0.1788 0.0512 -0.1080 -0.2996 -0.3043 -0.3027 0.4192 -0.0474 -0.2205 -0.2543 0.0534 -0.0732 -0.3110 -0.0362 0.1987 -0.0434 0.0438 -0.1682 -0.2042 -0.1759 -0.1560 -0.1719 0.1001 0.0922 0.0934 0.0946 0.0986 0.1021 0.1087 0.0565 0.1202 0.0930 0.0940 0.0883 0.0976 0.0899 0.0949 0.1217 0.1211 0.1588 0.1785 0.1091 0.1117 0.1418 0.1404 0.1605 0.1595 0.1603
va: 2.1134 1.9934 2.2627 3.5825 3.7521 3.8358 3.9139 3.9279 3.8629 4.1643 3.7626 3.9215 3.9408 3.8580 3.6546 3.9435 3.9312 3.6373 3.8123 3.5971 3.8682 3.9159 3.8606 3.8632 3.8424 1.0247 1.0331 1.0084 1.0027 1.0003 1.0189 0.9987 1.0086 1.0117 0.9958 0.9962 1.0089 0.9961 1.0109 0.9974 1.0076 0.9990 1.0193 0.9932 1.0115 1.0135 1.0033 1.0090 0.9906 0.9900 0.9902
dispcorr: -0.028161758 hartree
energy: -1079.765257580397
dipole: 13.28068 -13.63488 -0.35420 19.92501 -19.41283 0.51218 -9.70114 8.54877 -1.15236
magnitude: 1.30986 au
magnitude: 3.32939 debye
