program: Orca
programVersion: 5.0.2
elementType: O O O C C C C C C C C C C C C C C C C C C C C C C H H H H H H H H H H H H H H H H H H H H H H H H H H
charge: 0
multiplicity: 1
keywords: wb97x-d3
keywords: def2-TZVPP
keywords: def2/J RIJCOSX
keywords: DEFGRID2
keywords: scfconv7
keywords: smallprint printgap noloewdin
keywords: NOSOSCF
formula: C22H26O3
InChI: InChI=1/C22H26O3/c1-15(2)10-19-20(22(19,3)4)21(23)25-14-17-12-18(24-13-17)11-16-8-6-5-7-9-16/h5-10,12-13,19-20H,11,14H2,1-4H3
51 atoms
O  1.258342 -1.1296 0.04756
O  3.362858 -1.81767 0.338797
O  -2.742137 -1.840954 1.655279
C  3.946606 0.370388 -1.864261
C  4.281976 0.90095 -0.51458
C  2.918989 0.273811 -0.742917
C  3.592894 1.341713 -2.964956
C  4.659451 -0.859355 -2.369201
C  4.393974 2.356336 -0.23441
C  2.576622 -0.991774 -0.074311
C  4.015884 2.949964 0.900909
C  4.185845 4.423712 1.106359
C  3.393695 2.217797 2.048545
C  0.76363 -2.300964 0.72275
C  -0.709499 -2.160734 0.818877
C  -1.6690 -2.235977 -0.243614
C  -1.421927 -1.917167 1.941715
C  -2.883719 -2.036315 0.316519
C  -4.255324 -1.95306 -0.243354
C  -4.816771 -0.552473 -0.173007
C  -4.23056 0.473666 -0.911401
C  -5.914339 -0.258682 0.627583
C  -4.734683 1.763689 -0.854549
C  -6.423068 1.033701 0.686425
C  -5.83439 2.048618 -0.053164
H  4.957607 0.267795 0.056397
H  2.090893 0.96698 -0.835295
H  3.036298 2.204722 -2.599282
H  2.981618 0.851785 -3.724758
H  4.495811 1.709964 -3.456464
H  5.004346 -1.514348 -1.573342
H  5.537166 -0.55861 -2.943488
H  4.018325 -1.441006 -3.033501
H  4.842921 2.969058 -1.011419
H  4.824449 4.627926 1.969381
H  4.625007 4.913086 0.237299
H  3.225387 4.902006 1.315033
H  3.34254 1.141042 1.899028
H  3.953936 2.400674 2.968808
H  2.378878 2.581166 2.231427
H  1.207364 -2.37931 1.717229
H  1.039384 -3.191788 0.154173
H  -1.473519 -2.417381 -1.288854
H  -1.138269 -1.789246 2.974823
H  -4.920621 -2.644409 0.279563
H  -4.209706 -2.286323 -1.281679
H  -3.37232 0.259937 -1.538092
H  -6.378832 -1.046614 1.20824
H  -4.27068 2.548288 -1.438135
H  -7.279889 1.245727 1.312711
H  -6.229008 3.055225 -0.008398
elementType: O C H
totalener: -1079.74075285 hartree
nucrepener: 2046.20812136 hartree
electener: -3125.94887420 hartree
oneelecener: -5531.49391041 hartree
twoeener: 2405.54503621 hartree
cpcmener: -0.03078192 hartree
kineticenergy: 1074.85040816 hartree
xcener: -106.458238800229 hartree
chargesum: 0.0000000
charge: -0.281814 -0.512461 -0.287360 0.148257 -0.010168 -0.099929 -0.285418 -0.280041 -0.299054 0.415413 -0.014340 -0.228610 -0.244062 0.090997 -0.086332 -0.315840 -0.030014 0.194687 -0.050294 0.017044 -0.188937 -0.185692 -0.165419 -0.159362 -0.173038 0.101154 0.094003 0.094341 0.098411 0.099009 0.090074 0.096213 0.099963 0.124375 0.096530 0.089774 0.095052 0.082928 0.101587 0.100430 0.109770 0.116126 0.164868 0.179825 0.107389 0.118220 0.147075 0.142835 0.160803 0.159987 0.161046
qa: -0.2818 -0.5125 -0.2874 0.1483 -0.0102 -0.0999 -0.2854 -0.2800 -0.2991 0.4154 -0.0143 -0.2286 -0.2441 0.0910 -0.0863 -0.3158 -0.0300 0.1947 -0.0503 0.0170 -0.1889 -0.1857 -0.1654 -0.1594 -0.1730 0.1012 0.0940 0.0943 0.0984 0.0990 0.0901 0.0962 0.1000 0.1244 0.0965 0.0898 0.0951 0.0829 0.1016 0.1004 0.1098 0.1161 0.1649 0.1798 0.1074 0.1182 0.1471 0.1428 0.1608 0.1600 0.1610
va: 2.1123 1.9857 2.2628 3.6962 3.8059 3.8396 3.9099 3.8923 3.8919 4.0954 3.7062 3.9297 3.9369 3.8413 3.7413 3.9853 3.9459 3.6274 3.8164 3.6237 3.9268 3.9374 3.9045 3.8886 3.8925 1.0269 1.0304 1.0015 1.0029 0.9998 1.0187 1.0010 0.9989 1.0031 0.9962 1.0062 0.9965 1.0124 0.9994 0.9983 1.0025 0.9923 1.0066 0.9936 1.0090 1.0056 1.0026 1.0031 0.9905 0.9901 0.9894
dispcorr: -0.021917435 hartree
energy: -1079.762670280731
dipole: 20.75692 -21.50328 -0.74635 16.25896 -15.60888 0.65008 -6.07555 5.57322 -0.50234
magnitude: 1.10995 au
magnitude: 2.82127 debye
