program: Orca
programVersion: 5.0.2
elementType: O O O C C C C C C C C C C C C C C C C C C C C C C H H H H H H H H H H H H H H H H H H H H H H H H H H
charge: 0
multiplicity: 1
keywords: wb97x-d3
keywords: def2-TZVPP
keywords: def2/J RIJCOSX
keywords: DEFGRID2
keywords: scfconv7
keywords: smallprint printgap noloewdin
keywords: NOSOSCF
formula: C22H26O3
InChI: InChI=1/C22H26O3/c1-15(2)10-19-20(22(19,3)4)21(23)25-14-17-12-18(24-13-17)11-16-8-6-5-7-9-16/h5-10,12-13,19-20H,11,14H2,1-4H3
51 atoms
O  1.59996 -1.898665 -0.440514
O  0.750081 -0.753808 -2.167235
O  -2.169036 -2.776365 1.487066
C  1.503021 1.598955 -0.174666
C  2.38239 1.611106 -1.379994
C  2.2145 0.321991 -0.610691
C  2.004822 2.206662 1.112199
C  0.008807 1.733301 -0.343512
C  3.700006 2.299918 -1.389298
C  1.447413 -0.798969 -1.177215
C  4.779023 1.874399 -2.051394
C  6.066617 2.63937 -2.022535
C  4.802921 0.617988 -2.865705
C  0.746962 -3.029484 -0.700621
C  -0.582066 -2.821368 -0.066162
C  -1.712601 -2.09864 -0.572323
C  -0.924509 -3.207802 1.185057
C  -2.642894 -2.097827 0.410171
C  -3.962095 -1.42751 0.549354
C  -3.810927 -0.109737 1.272855
C  -3.645083 1.070877 0.554426
C  -3.772008 -0.061121 2.66382
C  -3.442314 2.277015 1.211594
C  -3.56636 1.142993 3.323323
C  -3.39818 2.315859 2.598832
H  1.845591 1.630508 -2.325797
H  3.0390 0.026459 0.028591
H  1.478572 1.775823 1.96591
H  1.824241 3.283462 1.124335
H  3.071738 2.045577 1.265104
H  -0.34579 1.418783 -1.322969
H  -0.280491 2.778483 -0.216892
H  -0.524481 1.152992 0.412153
H  3.7698 3.228942 -0.83002
H  6.878257 2.021695 -1.629599
H  6.367718 2.938953 -3.029506
H  5.998278 3.537565 -1.409128
H  5.559138 -0.073784 -2.4855
H  3.848003 0.095843 -2.882649
H  5.082213 0.837617 -3.89933
H  1.261724 -3.873784 -0.246493
H  0.668964 -3.218185 -1.770949
H  -1.818608 -1.636224 -1.54026
H  -0.407116 -3.775352 1.94307
H  -4.66263 -2.076662 1.079673
H  -4.369133 -1.260564 -0.448271
H  -3.672739 1.046325 -0.528696
H  -3.905883 -0.970547 3.237599
H  -3.316615 3.186626 0.638418
H  -3.538326 1.165031 4.405141
H  -3.237055 3.254685 3.112506
elementType: O C H
totalener: -1079.73839895 hartree
nucrepener: 2161.97792928 hartree
electener: -3241.71632823 hartree
oneelecener: -5763.63524628 hartree
twoeener: 2521.91891805 hartree
cpcmener: -0.02847340 hartree
kineticenergy: 1074.86114554 hartree
xcener: -106.461653711213 hartree
chargesum: -0.0000000
charge: -0.287492 -0.501893 -0.283791 0.187680 -0.018461 -0.124458 -0.292632 -0.306128 -0.298953 0.424357 -0.019575 -0.228357 -0.240210 0.073185 -0.062649 -0.359311 -0.037952 0.230889 -0.042512 0.086542 -0.249819 -0.212011 -0.158372 -0.153411 -0.169638 0.104729 0.096152 0.097651 0.099925 0.095071 0.096212 0.102557 0.094009 0.124813 0.095027 0.096010 0.089896 0.098279 0.079784 0.101503 0.119965 0.120019 0.161089 0.179021 0.114802 0.108531 0.143886 0.142801 0.161524 0.160325 0.161391
qa: -0.2875 -0.5019 -0.2838 0.1877 -0.0185 -0.1245 -0.2926 -0.3061 -0.2990 0.4244 -0.0196 -0.2284 -0.2402 0.0732 -0.0626 -0.3593 -0.0380 0.2309 -0.0425 0.0865 -0.2498 -0.2120 -0.1584 -0.1534 -0.1696 0.1047 0.0962 0.0977 0.0999 0.0951 0.0962 0.1026 0.0940 0.1248 0.0950 0.0960 0.0899 0.0983 0.0798 0.1015 0.1200 0.1200 0.1611 0.1790 0.1148 0.1085 0.1439 0.1428 0.1615 0.1603 0.1614
va: 2.1148 1.9941 2.2682 3.6735 3.8271 3.8258 3.9038 3.8881 3.8874 4.1219 3.7131 3.9291 3.9344 3.8423 3.6495 3.9649 3.9671 3.6022 3.8044 3.5379 3.9076 3.9602 3.8412 3.8947 3.8893 1.0243 1.0314 1.0027 0.9996 1.0022 1.0157 1.0025 0.9936 1.0024 0.9966 0.9960 1.0060 0.9987 1.0161 0.9993 0.9973 1.0078 1.0185 0.9923 1.0107 1.0112 1.0045 1.0098 0.9891 0.9895 0.9885
dispcorr: -0.025829428 hartree
energy: -1079.764228374214
dipole: 19.19641 -18.71870 0.47771 16.98198 -16.99168 -0.00970 -4.67964 5.35908 0.67944
magnitude: 0.83062 au
magnitude: 2.11128 debye
