program: Orca
programVersion: 5.0.2
elementType: O O O C C C C C C C C C C C C C C C C C C C C C C H H H H H H H H H H H H H H H H H H H H H H H H H H
charge: 0
multiplicity: 1
keywords: wb97x-d3
keywords: def2-TZVPP
keywords: def2/J RIJCOSX
keywords: DEFGRID2
keywords: scfconv7
keywords: smallprint printgap noloewdin
keywords: NOSOSCF
formula: C22H26O3
InChI: InChI=1/C22H26O3/c1-15(2)10-19-20(22(19,3)4)21(23)25-14-17-12-18(24-13-17)11-16-8-6-5-7-9-16/h5-10,12-13,19-20H,11,14H2,1-4H3
51 atoms
O  1.062899 -1.104983 0.260781
O  3.029703 -1.864677 -0.477414
O  -2.869699 -2.306008 1.653221
C  2.902031 1.034648 -1.81769
C  3.978491 0.949378 -0.772653
C  2.581556 0.490813 -0.435557
C  2.301535 2.377326 -2.154353
C  2.975621 0.103917 -3.002299
C  4.521684 2.151437 -0.100619
C  2.287347 -0.942563 -0.23162
C  5.781456 2.592665 -0.169915
C  6.207472 3.82548 0.569708
C  6.866266 1.936568 -0.967688
C  0.588951 -2.445812 0.473759
C  -0.876211 -2.358216 0.684489
C  -1.87389 -2.102105 -0.311133
C  -1.546251 -2.468521 1.854135
C  -3.064032 -2.081562 0.331734
C  -4.454822 -1.826595 -0.121792
C  -4.988093 -0.513348 0.400535
C  -4.497934 0.689826 -0.102839
C  -5.952492 -0.478348 1.401028
C  -4.965502 1.901934 0.381029
C  -6.423179 0.735155 1.888524
C  -5.931187 1.928152 1.380233
H  4.686249 0.143069 -0.937006
H  1.988091 1.157879 0.181512
H  2.910624 2.89195 -2.900547
H  2.218161 3.032802 -1.288157
H  1.300169 2.25618 -2.572459
H  1.977966 -0.131948 -3.379606
H  3.480544 -0.834364 -2.780519
H  3.526579 0.583697 -3.813826
H  3.819517 2.722407 0.500773
H  6.579394 4.588392 -0.119719
H  5.393034 4.263186 1.147031
H  7.028337 3.607163 1.258056
H  7.697224 1.639382 -0.323017
H  6.536686 1.055427 -1.514371
H  7.280936 2.638513 -1.695789
H  1.089168 -2.881967 1.34118
H  0.817615 -3.064302 -0.395864
H  -1.715572 -1.954525 -1.368268
H  -1.225255 -2.661525 2.86638
H  -5.110178 -2.644578 0.189263
H  -4.452746 -1.823749 -1.213247
H  -3.742296 0.677008 -0.880494
H  -6.342522 -1.406482 1.80214
H  -4.577472 2.828618 -0.022562
H  -7.175766 0.746199 2.666896
H  -6.296982 2.874327 1.757988
elementType: O C H
totalener: -1079.75544811 hartree
nucrepener: 2022.23412250 hartree
electener: -3101.98957061 hartree
oneelecener: -5483.39469891 hartree
twoeener: 2381.40512831 hartree
cpcmener: -0.02696219 hartree
kineticenergy: 1074.86329916 hartree
xcener: -106.459221361293 hartree
chargesum: -0.0000000
charge: -0.271339 -0.475189 -0.277436 0.127923 0.024133 -0.119528 -0.262132 -0.284247 -0.273275 0.404603 -0.037875 -0.223888 -0.252118 0.075181 -0.083623 -0.315266 -0.023996 0.194337 -0.062104 0.037595 -0.190555 -0.183728 -0.159197 -0.156235 -0.167697 0.090340 0.088506 0.095362 0.087943 0.098022 0.099401 0.092463 0.096056 0.117467 0.092693 0.088473 0.093348 0.096000 0.089944 0.094458 0.115530 0.109292 0.161560 0.175056 0.107814 0.117161 0.142678 0.137943 0.155832 0.156022 0.156290
qa: -0.2713 -0.4752 -0.2774 0.1279 0.0241 -0.1195 -0.2621 -0.2842 -0.2733 0.4046 -0.0379 -0.2239 -0.2521 0.0752 -0.0836 -0.3153 -0.0240 0.1943 -0.0621 0.0376 -0.1906 -0.1837 -0.1592 -0.1562 -0.1677 0.0903 0.0885 0.0954 0.0879 0.0980 0.0994 0.0925 0.0961 0.1175 0.0927 0.0885 0.0933 0.0960 0.0899 0.0945 0.1155 0.1093 0.1616 0.1751 0.1078 0.1172 0.1427 0.1379 0.1558 0.1560 0.1563
va: 2.1208 2.0335 2.2779 3.6986 3.7604 3.9013 3.9039 3.9038 3.8731 4.1676 3.7302 3.9245 3.9443 3.8493 3.7277 3.9928 3.9491 3.6341 3.8217 3.6014 3.9388 3.9495 3.9101 3.8972 3.8999 1.0336 1.0377 1.0031 1.0043 1.0027 0.9995 1.0181 1.0015 1.0092 0.9965 1.0085 0.9958 0.9974 1.0089 0.9977 0.9976 0.9998 1.0071 0.9952 1.0083 1.0062 1.0032 1.0048 0.9917 0.9911 0.9908
dispcorr: -0.021296063 hartree
energy: -1079.776744168997
dipole: 25.67524 -26.21547 -0.54023 18.81626 -18.08450 0.73176 -10.87161 10.54124 -0.33038
magnitude: 0.96771 au
magnitude: 2.45973 debye
