program: Orca
programVersion: 5.0.2
elementType: O O O C C C C C C C C C C C C C C C C C C C C C C H H H H H H H H H H H H H H H H H H H H H H H H H H
charge: 0
multiplicity: 1
keywords: wb97x-d3
keywords: def2-TZVPP
keywords: def2/J RIJCOSX
keywords: DEFGRID2
keywords: scfconv7
keywords: smallprint printgap noloewdin
keywords: NOSOSCF
formula: C22H26O3
InChI: InChI=1/C22H26O3/c1-15(2)10-19-20(22(19,3)4)21(23)25-14-17-12-18(24-13-17)11-16-8-6-5-7-9-16/h5-10,12-13,19-20H,11,14H2,1-4H3
51 atoms
O  1.180313 -0.469262 0.174512
O  2.800626 0.196703 1.557196
O  -2.767222 -1.352248 -0.598251
C  4.548434 -0.435971 -0.99649
C  4.407746 1.047486 -0.826756
C  3.168778 0.175795 -0.811979
C  4.839744 -1.006847 -2.3634
C  5.191044 -1.226108 0.116908
C  4.600478 1.990679 -1.946015
C  2.404078 -0.012551 0.434595
C  5.348507 3.098751 -1.941573
C  5.445969 3.957146 -3.167407
C  6.15514 3.584916 -0.776175
C  0.322951 -0.746611 1.279803
C  -1.009685 -1.113859 0.733445
C  -2.066017 -1.74964 1.459431
C  -1.495081 -0.897908 -0.510951
C  -3.108097 -1.866722 0.602279
C  -4.497597 -2.369797 0.769565
C  -5.467379 -1.244137 1.045108
C  -5.866309 -0.963616 2.348397
C  -5.945691 -0.443385 0.010656
C  -6.725261 0.093789 2.616146
C  -6.801203 0.616866 0.275963
C  -7.193221 0.889974 1.579979
H  4.707245 1.407353 0.151863
H  2.560075 0.193831 -1.709698
H  4.304894 -0.49584 -3.162891
H  4.55737 -2.060821 -2.403908
H  5.907317 -0.94311 -2.584985
H  6.26252 -1.317923 -0.07281
H  4.781361 -2.237314 0.16842
H  5.074818 -0.766014 1.095581
H  4.074178 1.747778 -2.864937
H  6.479848 4.027909 -3.516681
H  4.84081 3.573649 -3.989082
H  5.121132 4.980076 -2.959177
H  5.90201 4.620784 -0.537188
H  6.024318 2.994094 0.128388
H  7.220577 3.578399 -1.02141
H  0.242953 0.128795 1.930371
H  0.73243 -1.563292 1.880825
H  -2.046739 -2.072353 2.488976
H  -1.078053 -0.464436 -1.405818
H  -4.506501 -3.076405 1.600367
H  -4.802843 -2.923667 -0.121975
H  -5.50297 -1.57934 3.163173
H  -5.651108 -0.649538 -1.011778
H  -7.028855 0.294405 3.635945
H  -7.164394 1.230458 -0.538858
H  -7.862497 1.71536 1.786388
elementType: O C H
totalener: -1079.75421349 hartree
nucrepener: 1987.65122639 hartree
electener: -3067.40543989 hartree
oneelecener: -5414.17156447 hartree
twoeener: 2346.76612458 hartree
cpcmener: -0.02573553 hartree
kineticenergy: 1074.85207580 hartree
xcener: -106.460454942630 hartree
chargesum: -0.0000000
charge: -0.277295 -0.474260 -0.279405 0.098481 0.047260 -0.088851 -0.265195 -0.276570 -0.274158 0.392241 -0.052174 -0.217472 -0.249815 0.108088 -0.025596 -0.352404 -0.069558 0.216878 -0.073806 0.052235 -0.196763 -0.200218 -0.148167 -0.154339 -0.175669 0.089545 0.089282 0.086928 0.096927 0.096989 0.095814 0.098277 0.092549 0.116474 0.092406 0.087550 0.092635 0.093519 0.089638 0.096888 0.107934 0.110713 0.161090 0.171459 0.105313 0.116010 0.139510 0.138408 0.156273 0.156880 0.157521
qa: -0.2773 -0.4743 -0.2794 0.0985 0.0473 -0.0889 -0.2652 -0.2766 -0.2742 0.3922 -0.0522 -0.2175 -0.2498 0.1081 -0.0256 -0.3524 -0.0696 0.2169 -0.0738 0.0522 -0.1968 -0.2002 -0.1482 -0.1543 -0.1757 0.0895 0.0893 0.0869 0.0969 0.0970 0.0958 0.0983 0.0925 0.1165 0.0924 0.0876 0.0926 0.0935 0.0896 0.0969 0.1079 0.1107 0.1611 0.1715 0.1053 0.1160 0.1395 0.1384 0.1563 0.1569 0.1575
va: 2.1363 2.0354 2.2699 3.6988 3.7605 3.8547 3.9096 3.9037 3.8703 4.1650 3.7662 3.9209 3.9408 3.8443 3.7132 4.0148 3.9505 3.6344 3.8246 3.5994 3.9431 3.9605 3.8915 3.9013 3.9057 1.0334 1.0320 1.0066 1.0023 1.0019 1.0004 0.9994 1.0194 1.0109 0.9959 1.0090 0.9968 0.9975 1.0103 0.9966 0.9942 0.9926 1.0067 1.0006 1.0108 1.0093 1.0041 1.0124 0.9909 0.9909 0.9905
dispcorr: -0.020954715 hartree
energy: -1079.775168209128
dipole: 30.54943 -30.59531 -0.04588 9.60830 -9.91823 -0.30993 -9.77544 9.21818 -0.55725
magnitude: 0.63929 au
magnitude: 1.62495 debye
