program: Orca
programVersion: 5.0.2
elementType: O O O C C C C C C C C C C C C C C C C C C C C C C H H H H H H H H H H H H H H H H H H H H H H H H H H
charge: 0
multiplicity: 1
keywords: wb97x-d3
keywords: def2-TZVPP
keywords: def2/J RIJCOSX
keywords: DEFGRID2
keywords: scfconv7
keywords: smallprint printgap noloewdin
keywords: NOSOSCF
formula: C22H26O3
InChI: InChI=1/C22H26O3/c1-15(2)10-19-20(22(19,3)4)21(23)25-14-17-12-18(24-13-17)11-16-8-6-5-7-9-16/h5-10,12-13,19-20H,11,14H2,1-4H3
51 atoms
O  1.205173 -0.661201 0.101704
O  2.896218 -0.142335 1.460013
O  -2.739701 -1.613431 -0.581405
C  4.548595 -0.342414 -1.21154
C  4.292228 1.09852 -0.887393
C  3.133099 0.119757 -0.911681
C  4.815019 -0.747995 -2.641279
C  5.31849 -1.171513 -0.213539
C  4.360834 2.172468 -1.897469
C  2.441917 -0.22834 0.34337
C  5.031171 3.31809 -1.744472
C  5.043061 4.359502 -2.820678
C  5.808727 3.650048 -0.497788
C  0.399101 -1.022097 1.220545
C  -0.959781 -1.344952 0.713624
C  -2.049847 -1.824665 1.506888
C  -1.439292 -1.238112 -0.54666
C  -3.103694 -1.969279 0.668409
C  -4.520331 -2.364724 0.892306
C  -5.413744 -1.164136 1.101251
C  -5.825265 -0.383766 0.023101
C  -5.812845 -0.7983 2.383009
C  -6.614616 0.739576 0.224961
C  -6.605549 0.323291 2.587482
C  -7.007232 1.097742 1.508106
H  4.605734 1.383159 0.112173
H  2.482286 0.173193 -1.777832
H  4.62332 -1.814373 -2.776219
H  5.85926 -0.565274 -2.903933
H  4.194962 -0.212313 -3.359313
H  4.994541 -2.214457 -0.230921
H  5.229674 -0.808189 0.807756
H  6.379518 -1.154921 -0.471668
H  3.823447 2.007573 -2.82655
H  4.652091 5.311426 -2.450514
H  6.062821 4.559175 -3.16171
H  4.450197 4.066364 -3.687384
H  6.372456 4.57511 -0.619239
H  5.154696 3.787155 0.366502
H  6.524133 2.868921 -0.235308
H  0.351416 -0.198468 1.938487
H  0.833028 -1.881507 1.739736
H  -2.044234 -2.027999 2.56664
H  -1.002434 -0.934342 -1.484377
H  -4.559727 -3.009971 1.770792
H  -4.877257 -2.958948 0.047135
H  -5.530325 -0.655481 -0.983776
H  -5.501971 -1.397347 3.231182
H  -6.926366 1.336094 -0.62316
H  -6.909019 0.591017 3.591793
H  -7.625236 1.972621 1.66477
elementType: O C H
totalener: -1079.75300763 hartree
nucrepener: 1991.15544330 hartree
electener: -3070.90845093 hartree
oneelecener: -5421.20415334 hartree
twoeener: 2350.29570241 hartree
cpcmener: -0.02522795 hartree
kineticenergy: 1074.84966073 hartree
xcener: -106.459647023796 hartree
chargesum: -0.0000000
charge: -0.277283 -0.475235 -0.278915 0.105035 0.051056 -0.097914 -0.268074 -0.278397 -0.298985 0.392130 -0.009198 -0.222033 -0.285339 0.108349 -0.025791 -0.351020 -0.071396 0.217985 -0.072786 0.044976 -0.197885 -0.191931 -0.154689 -0.149118 -0.175115 0.090362 0.089486 0.097574 0.096930 0.087411 0.098119 0.092535 0.094515 0.116267 0.097558 0.095715 0.084434 0.094143 0.104283 0.103757 0.107618 0.110193 0.160702 0.172124 0.104423 0.115922 0.137774 0.139469 0.156840 0.155794 0.157626
qa: -0.2773 -0.4752 -0.2789 0.1050 0.0511 -0.0979 -0.2681 -0.2784 -0.2990 0.3921 -0.0092 -0.2220 -0.2853 0.1083 -0.0258 -0.3510 -0.0714 0.2180 -0.0728 0.0450 -0.1979 -0.1919 -0.1547 -0.1491 -0.1751 0.0904 0.0895 0.0976 0.0969 0.0874 0.0981 0.0925 0.0945 0.1163 0.0976 0.0957 0.0844 0.0941 0.1043 0.1038 0.1076 0.1102 0.1607 0.1721 0.1044 0.1159 0.1378 0.1395 0.1568 0.1558 0.1576
va: 2.1370 2.0334 2.2677 3.6928 3.7548 3.8861 3.9140 3.9060 3.8962 4.1564 3.6933 3.9217 3.9409 3.8521 3.7172 4.0081 3.9511 3.6276 3.8197 3.6109 3.9584 3.9394 3.9029 3.8925 3.9049 1.0288 1.0313 1.0021 1.0019 1.0061 0.9996 1.0197 1.0002 1.0104 0.9927 0.9931 1.0104 1.0049 0.9961 0.9955 0.9934 0.9912 1.0068 1.0004 1.0109 1.0096 1.0133 1.0040 0.9911 0.9912 0.9905
dispcorr: -0.021032652 hartree
energy: -1079.774040282249
dipole: 29.41601 -29.51991 -0.10389 11.85564 -11.97058 -0.11493 -9.38685 8.88131 -0.50554
magnitude: 0.52875 au
magnitude: 1.34397 debye
