program: Orca
programVersion: 5.0.2
elementType: O O O C C C C C C C C C C C C C C C C C C C C C C H H H H H H H H H H H H H H H H H H H H H H H H H H
charge: 0
multiplicity: 1
keywords: wb97x-d3
keywords: def2-TZVPP
keywords: def2/J RIJCOSX
keywords: DEFGRID2
keywords: scfconv7
keywords: smallprint printgap noloewdin
keywords: NOSOSCF
formula: C22H26O3
InChI: InChI=1/C22H26O3/c1-15(2)10-19-20(22(19,3)4)21(23)25-14-17-12-18(24-13-17)11-16-8-6-5-7-9-16/h5-10,12-13,19-20H,11,14H2,1-4H3
51 atoms
O  1.714785 -2.375197 -0.852487
O  2.047575 -1.5306 1.189001
O  -2.17007 -2.417276 1.244163
C  3.871649 0.534489 -0.302596
C  2.50292 1.11808 -0.134862
C  2.663538 -0.26623 -0.749861
C  4.765981 1.042201 -1.409083
C  4.643551 0.14391 0.934393
C  1.973786 2.212968 -0.969793
C  2.130469 -1.426473 -0.012237
C  1.270919 3.267098 -0.540731
C  0.762839 4.294447 -1.507752
C  0.908149 3.527166 0.890508
C  0.973979 -3.476226 -0.301456
C  -0.395966 -3.034697 0.066408
C  -1.39012 -2.514005 -0.823888
C  -0.930971 -2.9463 1.305334
C  -2.441885 -2.149098 -0.0550
C  -3.709709 -1.436657 -0.354585
C  -3.619059 0.015692 0.055403
C  -2.81952 0.895279 -0.671894
C  -4.289175 0.489778 1.177081
C  -2.697468 2.221739 -0.288454
C  -4.167358 1.818998 1.565503
C  -3.370321 2.687963 0.835078
H  2.141328 1.093151 0.887292
H  2.528459 -0.321379 -1.824522
H  5.258301 1.96902 -1.107134
H  4.229946 1.239553 -2.336773
H  5.5463 0.31208 -1.632829
H  4.007082 -0.092693 1.783562
H  5.292218 0.969754 1.233698
H  5.283239 -0.720059 0.741342
H  2.1648 2.136822 -2.03638
H  0.994179 4.04089 -2.542419
H  -0.321897 4.408489 -1.42475
H  1.190581 5.278631 -1.297998
H  1.450262 2.907245 1.602615
H  1.102107 4.570816 1.150751
H  -0.161058 3.361885 1.054886
H  1.496687 -3.91829 0.548094
H  0.951546 -4.214949 -1.10193
H  -1.317635 -2.410892 -1.895619
H  -0.560672 -3.211522 2.28358
H  -4.551058 -1.918281 0.149611
H  -3.895609 -1.514085 -1.42723
H  -2.28586 0.537975 -1.54551
H  -4.913147 -0.183418 1.753365
H  -2.077564 2.89447 -0.868235
H  -4.695425 2.173183 2.441875
H  -3.274333 3.723665 1.135395
elementType: O C H
totalener: -1079.75334931 hartree
nucrepener: 2175.97189154 hartree
electener: -3255.72524085 hartree
oneelecener: -5791.50284549 hartree
twoeener: 2535.77760464 hartree
cpcmener: -0.02664126 hartree
kineticenergy: 1074.86539014 hartree
xcener: -106.462392708891 hartree
chargesum: -0.0000000
charge: -0.289090 -0.473572 -0.276643 0.105748 0.046445 -0.095256 -0.272060 -0.277750 -0.274228 0.396976 -0.064000 -0.215585 -0.242990 0.099309 -0.077978 -0.347001 -0.019985 0.208712 -0.062864 0.052880 -0.202299 -0.199270 -0.167019 -0.133585 -0.193128 0.094194 0.085137 0.097954 0.087561 0.097084 0.093200 0.093501 0.097071 0.115133 0.089014 0.085285 0.100187 0.092918 0.095931 0.087494 0.113923 0.119931 0.158429 0.173407 0.106136 0.115801 0.140444 0.138492 0.184010 0.156356 0.155642
qa: -0.2891 -0.4736 -0.2766 0.1057 0.0464 -0.0953 -0.2721 -0.2778 -0.2742 0.3970 -0.0640 -0.2156 -0.2430 0.0993 -0.0780 -0.3470 -0.0200 0.2087 -0.0629 0.0529 -0.2023 -0.1993 -0.1670 -0.1336 -0.1931 0.0942 0.0851 0.0980 0.0876 0.0971 0.0932 0.0935 0.0971 0.1151 0.0890 0.0853 0.1002 0.0929 0.0959 0.0875 0.1139 0.1199 0.1584 0.1734 0.1061 0.1158 0.1404 0.1385 0.1840 0.1564 0.1556
va: 2.1158 2.0319 2.2767 3.6932 3.7619 3.8501 3.9124 3.8981 3.8735 4.1633 3.7651 3.9173 3.9343 3.8373 3.6422 4.0000 3.9595 3.6222 3.8330 3.6006 3.9647 3.9611 3.8632 3.8887 3.9094 1.0328 1.0373 1.0014 1.0061 1.0016 1.0210 1.0001 0.9995 1.0125 1.0092 0.9957 0.9967 1.0094 0.9989 1.0017 1.0097 0.9909 1.0100 0.9979 1.0120 1.0070 1.0069 1.0048 0.9658 0.9901 0.9939
dispcorr: -0.024742157 hartree
energy: -1079.778091468793
dipole: 14.58661 -14.68877 -0.10216 21.12376 -20.83770 0.28606 -4.38150 3.29777 -1.08372
magnitude: 1.12549 au
magnitude: 2.86076 debye
