program: Orca
programVersion: 5.0.2
elementType: O O O C C C C C C C C C C C C C C C C C C C C C C H H H H H H H H H H H H H H H H H H H H H H H H H H
charge: 0
multiplicity: 1
keywords: wb97x-d3
keywords: def2-TZVPP
keywords: def2/J RIJCOSX
keywords: DEFGRID2
keywords: scfconv7
keywords: smallprint printgap noloewdin
keywords: NOSOSCF
formula: C22H26O3
InChI: InChI=1/C22H26O3/c1-15(2)10-19-20(22(19,3)4)21(23)25-14-17-12-18(24-13-17)11-16-8-6-5-7-9-16/h5-10,12-13,19-20H,11,14H2,1-4H3
51 atoms
O  1.450281 -2.165002 -0.869558
O  2.12355 -1.338949 1.096069
O  -2.185955 -2.203074 1.640387
C  4.056843 0.277996 -0.821089
C  2.963734 1.16226 -0.298651
C  2.607307 -0.16276 -0.93377
C  4.735178 0.633479 -2.121154
C  4.985408 -0.374425 0.172682
C  2.562594 2.419782 -0.967349
C  2.052094 -1.25255 -0.107348
C  2.639996 3.646318 -0.441428
C  2.18378 4.847657 -1.213857
C  3.184663 3.951488 0.920369
C  0.786748 -3.258523 -0.215269
C  -0.550369 -2.851257 0.290804
C  -1.741747 -2.6487 -0.479684
C  -0.888141 -2.55933 1.568543
C  -2.702187 -2.257946 0.389948
C  -4.120737 -1.849547 0.21726
C  -4.28724 -0.352761 0.330179
C  -4.077874 0.45971 -0.78105
C  -4.609297 0.242008 1.545836
C  -4.191581 1.838558 -0.681862
C  -4.722265 1.62261 1.648741
C  -4.512852 2.424642 0.535739
H  2.88765 1.16378 0.783973
H  2.201907 -0.120185 -1.939263
H  5.213272 -0.246462 -2.556356
H  5.512046 1.383216 -1.957395
H  4.043879 1.030677 -2.863783
H  5.345334 -1.337648 -0.195296
H  4.528045 -0.536445 1.14635
H  5.858734 0.26273 0.327206
H  2.167666 2.324717 -1.974895
H  3.004031 5.55546 -1.361041
H  1.78733 4.58421 -2.19436
H  1.404533 5.389691 -0.671201
H  3.499426 3.070428 1.476199
H  4.049842 4.615436 0.842044
H  2.445528 4.482676 1.525518
H  1.407971 -3.666005 0.583103
H  0.69232 -4.021245 -0.987116
H  -1.858792 -2.781848 -1.544181
H  -0.333003 -2.57364 2.493516
H  -4.749404 -2.354097 0.955529
H  -4.45075 -2.189659 -0.765265
H  -3.82592 0.007917 -1.733767
H  -4.778568 -0.377238 2.418962
H  -4.031337 2.456249 -1.556481
H  -4.975606 2.071741 2.60076
H  -4.60276 3.500481 0.615032
elementType: O C H
totalener: -1079.75485134 hartree
nucrepener: 2089.03069523 hartree
electener: -3168.78554657 hartree
oneelecener: -5617.68475716 hartree
twoeener: 2448.89921059 hartree
cpcmener: -0.02593856 hartree
kineticenergy: 1074.86752131 hartree
xcener: -106.461127171218 hartree
chargesum: -0.0000000
charge: -0.285131 -0.475810 -0.276901 0.129518 0.024585 -0.127349 -0.260586 -0.285312 -0.274435 0.409751 -0.037829 -0.223418 -0.251795 0.090909 -0.082145 -0.339745 -0.014004 0.207741 -0.066350 0.063754 -0.202227 -0.200093 -0.152976 -0.153052 -0.174244 0.091884 0.086233 0.096957 0.095958 0.086923 0.098204 0.092076 0.094596 0.118287 0.092785 0.088350 0.093308 0.089146 0.095688 0.095140 0.116909 0.120817 0.159365 0.170134 0.112573 0.111495 0.140908 0.138915 0.156807 0.156380 0.157309
qa: -0.2851 -0.4758 -0.2769 0.1295 0.0246 -0.1273 -0.2606 -0.2853 -0.2744 0.4098 -0.0378 -0.2234 -0.2518 0.0909 -0.0821 -0.3397 -0.0140 0.2077 -0.0663 0.0638 -0.2022 -0.2001 -0.1530 -0.1531 -0.1742 0.0919 0.0862 0.0970 0.0960 0.0869 0.0982 0.0921 0.0946 0.1183 0.0928 0.0883 0.0933 0.0891 0.0957 0.0951 0.1169 0.1208 0.1594 0.1701 0.1126 0.1115 0.1409 0.1389 0.1568 0.1564 0.1573
va: 2.1218 2.0307 2.2826 3.6803 3.7608 3.8867 3.9065 3.9043 3.8718 4.1748 3.7394 3.9243 3.9447 3.8169 3.6231 4.0182 3.9518 3.6218 3.8250 3.5708 3.9475 3.9638 3.8998 3.8969 3.9033 1.0328 1.0393 1.0026 1.0032 1.0047 0.9995 1.0193 1.0005 1.0094 0.9962 1.0086 0.9961 1.0092 0.9971 0.9978 1.0118 0.9932 1.0081 1.0027 1.0087 1.0088 1.0038 1.0075 0.9909 0.9909 0.9906
dispcorr: -0.021966521 hartree
energy: -1079.776817857340
dipole: 21.00156 -21.02118 -0.01962 20.11535 -20.01750 0.09785 -6.53103 5.45937 -1.07166
magnitude: 1.07630 au
magnitude: 2.73573 debye
