program: Orca
programVersion: 5.0.2
elementType: O O O C C C C C C C C C C C C C C C C C C C C C C H H H H H H H H H H H H H H H H H H H H H H H H H H
charge: 0
multiplicity: 1
keywords: wb97x-d3
keywords: def2-TZVPP
keywords: def2/J RIJCOSX
keywords: DEFGRID2
keywords: scfconv7
keywords: smallprint printgap noloewdin
keywords: NOSOSCF
formula: C22H26O3
InChI: InChI=1/C22H26O3/c1-15(2)10-19-20(22(19,3)4)21(23)25-14-17-12-18(24-13-17)11-16-8-6-5-7-9-16/h5-10,12-13,19-20H,11,14H2,1-4H3
51 atoms
O  1.717792 -2.006977 -0.011646
O  1.162856 -1.247003 -2.040394
O  -2.608003 -2.470915 -0.369824
C  1.071079 1.408669 -0.294067
C  2.163113 1.452753 -1.311965
C  2.059786 0.251263 -0.406144
C  1.192085 2.244736 0.956317
C  -0.357415 1.242098 -0.752881
C  3.313203 2.387671 -1.192628
C  1.605958 -1.04802 -0.933683
C  4.571777 2.110588 -1.542379
C  5.661668 3.129232 -1.403581
C  5.005208 0.787368 -2.093181
C  0.972273 -3.217342 -0.227095
C  -0.470786 -2.936108 -0.00777
C  -1.070949 -2.507655 1.220315
C  -1.455381 -2.886738 -0.934104
C  -2.366041 -2.232874 0.941292
C  -3.463858 -1.639317 1.750445
C  -3.45029 -0.131874 1.64269
C  -4.076801 0.515262 0.58112
C  -2.752673 0.630783 2.575106
C  -4.009286 1.896549 0.456741
C  -2.685149 2.011992 2.454298
C  -3.312867 2.649435 1.392471
H  1.82972 1.263299 -2.330229
H  2.771354 0.186594 0.410117
H  0.600921 1.810055 1.76515
H  0.814288 3.254988 0.782798
H  2.220266 2.330196 1.308834
H  -0.957256 0.734702 0.006651
H  -0.449147 0.681479 -1.681202
H  -0.804571 2.223694 -0.923112
H  3.092444 3.383037 -0.816027
H  5.297364 4.06934 -0.989029
H  6.460685 2.761585 -0.753942
H  6.12583 3.34423 -2.369821
H  4.185496 0.082294 -2.219635
H  5.485873 0.916157 -3.066619
H  5.751537 0.322514 -1.442959
H  1.362872 -3.916193 0.511348
H  1.161642 -3.632545 -1.217943
H  -0.589621 -2.403939 2.180625
H  -1.482686 -3.112917 -1.988698
H  -3.327864 -1.937838 2.790786
H  -4.428354 -2.037855 1.427885
H  -4.624055 -0.06296 -0.154253
H  -2.257375 0.140426 3.405397
H  -4.503123 2.385998 -0.373164
H  -2.142333 2.590305 3.1914
H  -3.261853 3.726458 1.296341
elementType: O C H
totalener: -1079.75118835 hartree
nucrepener: 2203.17682342 hartree
electener: -3282.92801178 hartree
oneelecener: -5845.91637965 hartree
twoeener: 2562.98836787 hartree
cpcmener: -0.02443014 hartree
kineticenergy: 1074.86328474 hartree
xcener: -106.461906706735 hartree
chargesum: -0.0000000
charge: -0.286378 -0.461593 -0.273039 0.210508 -0.019145 -0.117608 -0.309178 -0.270911 -0.299662 0.367384 -0.017578 -0.228776 -0.237235 0.094494 -0.059219 -0.346671 -0.030704 0.209552 -0.059673 0.043677 -0.186344 -0.168086 -0.159635 -0.181473 -0.161290 0.104232 0.096136 0.094015 0.100664 0.099376 0.045018 0.099999 0.104585 0.121129 0.088534 0.093559 0.095537 0.080568 0.099892 0.097295 0.119909 0.114615 0.156708 0.172254 0.109241 0.111817 0.137598 0.137358 0.154888 0.157399 0.156260
qa: -0.2864 -0.4616 -0.2730 0.2105 -0.0191 -0.1176 -0.3092 -0.2709 -0.2997 0.3674 -0.0176 -0.2288 -0.2372 0.0945 -0.0592 -0.3467 -0.0307 0.2096 -0.0597 0.0437 -0.1863 -0.1681 -0.1596 -0.1815 -0.1613 0.1042 0.0961 0.0940 0.1007 0.0994 0.0450 0.1000 0.1046 0.1211 0.0885 0.0936 0.0955 0.0806 0.0999 0.0973 0.1199 0.1146 0.1567 0.1723 0.1092 0.1118 0.1376 0.1374 0.1549 0.1574 0.1563
va: 2.1020 2.0393 2.2708 3.6248 3.8302 3.8111 3.9074 3.8917 3.8916 4.2085 3.7116 3.9308 3.9329 3.8414 3.6427 3.9783 3.9476 3.6098 3.8160 3.5989 3.9253 3.8780 3.8880 3.8728 3.8538 1.0253 1.0302 1.0048 0.9992 1.0043 1.0101 1.0245 1.0010 1.0033 1.0065 0.9968 0.9962 1.0159 0.9996 0.9988 0.9919 1.0101 1.0113 0.9994 1.0104 1.0135 1.0096 1.0043 0.9919 0.9912 0.9913
dispcorr: -0.027858612 hartree
energy: -1079.779046966110
dipole: 17.16258 -16.91277 0.24981 17.75421 -17.58793 0.16629 -0.80937 2.00596 1.19658
magnitude: 1.23364 au
magnitude: 3.13567 debye
