program: Orca
programVersion: 5.0.2
elementType: O O O C C C C C C C C C C C C C C C C C C C C C C H H H H H H H H H H H H H H H H H H H H H H H H H H
charge: 0
multiplicity: 1
keywords: wb97x-d3
keywords: def2-TZVPP
keywords: def2/J RIJCOSX
keywords: DEFGRID2
keywords: scfconv7
keywords: smallprint printgap noloewdin
keywords: NOSOSCF
formula: C22H26O3
InChI: InChI=1/C22H26O3/c1-15(2)10-19-20(22(19,3)4)21(23)25-14-17-12-18(24-13-17)11-16-8-6-5-7-9-16/h5-10,12-13,19-20H,11,14H2,1-4H3
51 atoms
O  1.649413 -1.704509 0.088283
O  1.845448 0.263835 1.130275
O  -1.997583 -0.172066 -1.287219
C  4.776062 0.138699 -0.026298
C  3.928422 1.021772 -0.873669
C  3.440024 -0.381163 -0.536261
C  5.989969 -0.528283 -0.627374
C  4.959923 0.487014 1.430516
C  4.256053 1.377681 -2.275668
C  2.255455 -0.536362 0.323386
C  3.391805 1.916993 -3.140668
C  3.807603 2.289138 -4.530772
C  1.95755 2.196172 -2.810974
C  0.434009 -1.97783 0.779861
C  -0.721588 -1.286449 0.143255
C  -2.0431 -1.173624 0.683439
C  -0.756568 -0.662349 -1.055839
C  -2.773744 -0.487535 -0.228654
C  -4.198977 -0.060236 -0.288238
C  -4.866974 -0.119809 1.058632
C  -5.802563 -1.105185 1.353157
C  -4.551131 0.819372 2.038656
C  -6.41536 -1.151969 2.600047
C  -5.159302 0.775186 3.283681
C  -6.095471 -0.212065 3.568237
H  3.404526 1.793947 -0.316997
H  3.514539 -1.114707 -1.33115
H  5.832032 -0.849651 -1.656863
H  6.263524 -1.412767 -0.048703
H  6.846919 0.148725 -0.616433
H  5.084458 -0.411966 2.037819
H  4.133048 1.060242 1.843328
H  5.863664 1.088386 1.549569
H  5.274324 1.200179 -2.60951
H  4.856474 2.06234 -4.722398
H  3.206492 1.760516 -5.275497
H  3.65506 3.356146 -4.714428
H  1.666092 1.862504 -1.815982
H  1.744895 3.266684 -2.879593
H  1.296584 1.708534 -3.532538
H  0.512784 -1.715913 1.837303
H  0.313038 -3.060784 0.725171
H  -2.389932 -1.553896 1.631567
H  -0.018891 -0.482172 -1.822387
H  -4.743035 -0.68894 -1.000052
H  -4.24989 0.958906 -0.683103
H  -6.059624 -1.841662 0.600703
H  -3.822799 1.593027 1.823893
H  -7.145408 -1.922982 2.811661
H  -4.904991 1.514198 4.032964
H  -6.573638 -0.244882 4.538947
elementType: O C H
totalener: -1079.75250875 hartree
nucrepener: 2068.52687359 hartree
electener: -3148.27938234 hartree
oneelecener: -5576.17591338 hartree
twoeener: 2427.89653104 hartree
cpcmener: -0.02504303 hartree
kineticenergy: 1074.84782226 hartree
xcener: -106.461369732592 hartree
chargesum: 0.0000000
charge: -0.292955 -0.468639 -0.285139 0.152032 -0.035195 -0.062387 -0.293664 -0.273239 -0.277712 0.351347 -0.004492 -0.230468 -0.260599 0.110648 -0.047858 -0.323042 -0.062937 0.190068 -0.013437 -0.001925 -0.174169 -0.205897 -0.154136 -0.144874 -0.169229 0.100526 0.090256 0.089044 0.098546 0.101459 0.098326 0.093026 0.094255 0.123081 0.088424 0.094132 0.094623 0.077351 0.103825 0.096648 0.113000 0.120990 0.161000 0.176821 0.100000 0.110201 0.138447 0.143581 0.156129 0.156593 0.157616
qa: -0.2930 -0.4686 -0.2851 0.1520 -0.0352 -0.0624 -0.2937 -0.2732 -0.2777 0.3513 -0.0045 -0.2305 -0.2606 0.1106 -0.0479 -0.3230 -0.0629 0.1901 -0.0134 -0.0019 -0.1742 -0.2059 -0.1541 -0.1449 -0.1692 0.1005 0.0903 0.0890 0.0985 0.1015 0.0983 0.0930 0.0943 0.1231 0.0884 0.0941 0.0946 0.0774 0.1038 0.0966 0.1130 0.1210 0.1610 0.1768 0.1000 0.1102 0.1384 0.1436 0.1561 0.1566 0.1576
va: 2.1172 2.0253 2.2689 3.7351 3.8213 3.7916 3.9161 3.8830 3.8888 4.1792 3.6920 3.9302 3.9485 3.8213 3.6775 3.9872 3.9505 3.6629 3.8028 3.6337 3.9229 3.9368 3.8973 3.8865 3.8978 1.0241 1.0336 1.0017 1.0025 0.9983 0.9998 1.0191 1.0008 1.0039 1.0069 0.9966 0.9955 1.0132 1.0003 0.9969 1.0132 0.9909 1.0015 0.9923 1.0065 1.0070 1.0047 1.0017 0.9912 0.9908 0.9903
dispcorr: -0.023002795 hartree
energy: -1079.775511545607
dipole: 22.31334 -22.19536 0.11798 7.66500 -8.27212 -0.60712 -8.97634 8.42646 -0.54987
magnitude: 0.82757 au
magnitude: 2.10352 debye
