program: Orca
programVersion: 5.0.2
elementType: O O O C C C C C C C C C C C C C C C C C C C C C C H H H H H H H H H H H H H H H H H H H H H H H H H H
charge: 0
multiplicity: 1
keywords: wb97x-d3
keywords: def2-TZVPP
keywords: def2/J RIJCOSX
keywords: DEFGRID2
keywords: scfconv7
keywords: smallprint printgap noloewdin
keywords: NOSOSCF
formula: C22H26O3
InChI: InChI=1/C22H26O3/c1-15(2)10-19-20(22(19,3)4)21(23)25-14-17-12-18(24-13-17)11-16-8-6-5-7-9-16/h5-10,12-13,19-20H,11,14H2,1-4H3
51 atoms
O  2.10517 -2.019181 0.034522
O  1.479139 -1.761121 -2.093042
O  -1.890642 -1.779875 1.524991
C  3.959352 0.403404 -0.396638
C  2.679007 0.796367 0.253564
C  2.649963 0.001774 -1.053232
C  4.748007 1.445322 -1.154747
C  4.844531 -0.621517 0.270838
C  2.134504 2.171972 0.293722
C  2.037643 -1.33792 -1.105528
C  0.8824 2.435759 0.680451
C  0.355195 3.834174 0.753474
C  -0.070451 1.33904 1.073372
C  1.230936 -3.148433 0.208704
C  -0.156311 -2.676449 0.469594
C  -1.204657 -2.430992 -0.475498
C  -0.639448 -2.260101 1.664573
C  -2.231856 -1.887735 0.218205
C  -3.552541 -1.346418 -0.193754
C  -3.547838 0.164507 -0.208811
C  -2.966614 0.850044 -1.273007
C  -4.076208 0.893606 0.850864
C  -2.92096 2.236013 -1.28192
C  -4.032193 2.28269 0.845305
C  -3.45539 2.957353 -0.221033
H  2.418158 0.192377 1.118092
H  2.408732 0.574209 -1.942063
H  5.399427 0.970195 -1.890881
H  5.382248 2.017599 -0.474409
H  4.112698 2.151213 -1.689613
H  4.303189 -1.301438 0.924369
H  5.593738 -0.114223 0.882285
H  5.379043 -1.219137 -0.470529
H  2.78646 2.993183 0.011867
H  1.106779 4.574985 0.479932
H  -0.505214 3.962878 0.091146
H  0.001673 4.067664 1.7617
H  0.219344 0.875724 2.020522
H  -1.085512 1.715812 1.199654
H  -0.101734 0.54201 0.327131
H  1.634721 -3.675068 1.071749
H  1.280949 -3.819779 -0.648767
H  -1.190468 -2.632038 -1.534771
H  -0.219575 -2.249317 2.658933
H  -4.338161 -1.71313 0.471835
H  -3.775759 -1.730584 -1.190389
H  -2.544282 0.292822 -2.10169
H  -4.530595 0.373581 1.68615
H  -2.468051 2.754655 -2.117578
H  -4.450394 2.837238 1.675954
H  -3.42282 4.039415 -0.227644
elementType: O C H
totalener: -1079.74849895 hartree
nucrepener: 2243.14105281 hartree
electener: -3322.88955177 hartree
oneelecener: -5925.61667953 hartree
twoeener: 2602.72712777 hartree
cpcmener: -0.02482681 hartree
kineticenergy: 1074.86195014 hartree
xcener: -106.462985961264 hartree
chargesum: -0.0000000
charge: -0.278550 -0.472277 -0.270467 0.153121 -0.009509 -0.071747 -0.297117 -0.268781 -0.325152 0.374784 0.051262 -0.223337 -0.314328 0.059062 -0.071797 -0.277253 -0.048475 0.174216 -0.055833 0.065729 -0.221353 -0.194462 -0.130606 -0.123163 -0.212033 0.096335 0.087842 0.099382 0.101488 0.087431 0.092612 0.092556 0.099618 0.123482 0.090453 0.089963 0.101650 0.118938 0.084753 0.085352 0.114407 0.119544 0.157250 0.172539 0.110143 0.115250 0.139093 0.137465 0.156526 0.154968 0.159025
qa: -0.2786 -0.4723 -0.2705 0.1531 -0.0095 -0.0717 -0.2971 -0.2688 -0.3252 0.3748 0.0513 -0.2233 -0.3143 0.0591 -0.0718 -0.2773 -0.0485 0.1742 -0.0558 0.0657 -0.2214 -0.1945 -0.1306 -0.1232 -0.2120 0.0963 0.0878 0.0994 0.1015 0.0874 0.0926 0.0926 0.0996 0.1235 0.0905 0.0900 0.1017 0.1189 0.0848 0.0854 0.1144 0.1195 0.1573 0.1725 0.1101 0.1152 0.1391 0.1375 0.1565 0.1550 0.1590
va: 2.0998 2.0330 2.2639 3.7560 3.7619 3.8154 3.9185 3.8727 3.8800 4.1843 3.6517 3.9116 3.9845 3.8610 3.6351 3.9834 3.9206 3.6566 3.8100 3.5452 3.9048 3.9530 3.8176 3.8524 3.8739 1.0259 1.0304 1.0017 0.9988 1.0026 1.0151 1.0010 1.0002 1.0072 1.0107 0.9969 0.9939 1.0004 1.0170 0.9907 0.9998 1.0060 1.0176 0.9954 1.0100 1.0086 1.0060 1.0065 0.9903 0.9910 0.9904
dispcorr: -0.029447393 hartree
energy: -1079.777946346968
dipole: 12.55061 -12.43654 0.11407 15.31097 -15.01765 0.29332 2.23020 -1.19868 1.03152
magnitude: 1.07846 au
magnitude: 2.74124 debye
