program: Orca
programVersion: 5.0.2
elementType: O O O C C C C C C C C C C C C C C C C C C C C C C H H H H H H H H H H H H H H H H H H H H H H H H H H
charge: 0
multiplicity: 1
keywords: wb97x-d3
keywords: def2-TZVPP
keywords: def2/J RIJCOSX
keywords: DEFGRID2
keywords: scfconv7
keywords: smallprint printgap noloewdin
keywords: NOSOSCF
formula: C22H26O3
InChI: InChI=1/C22H26O3/c1-15(2)10-19-20(22(19,3)4)21(23)25-14-17-12-18(24-13-17)11-16-8-6-5-7-9-16/h5-10,12-13,19-20H,11,14H2,1-4H3
51 atoms
O  1.547388 -2.103904 -0.676369
O  2.158589 -1.23105 1.289557
O  -2.248481 -1.972624 1.563774
C  4.255383 0.203098 -0.615181
C  3.21262 1.163289 -0.126714
C  2.783642 -0.148575 -0.753427
C  4.985967 0.482012 -1.906369
C  5.114549 -0.49602 0.409145
C  2.898405 2.432816 -0.810709
C  2.14726 -1.187118 0.081508
C  2.722176 3.62013 -0.221528
C  2.372704 4.835255 -1.027679
C  2.824683 3.858227 1.256469
C  0.834205 -3.163065 -0.015257
C  -0.533766 -2.733878 0.380133
C  -1.697849 -2.68843 -0.454639
C  -0.937012 -2.28313 1.591658
C  -2.709209 -2.223283 0.314731
C  -4.139004 -1.929171 0.038137
C  -4.425933 -0.446047 0.020579
C  -5.039871 0.177747 1.101137
C  -4.054969 0.325626 -1.078342
C  -5.283794 1.545827 1.083814
C  -4.297743 1.690853 -1.099246
C  -4.914838 2.305805 -0.016675
H  3.110404 1.179358 0.952999
H  2.403754 -0.099044 -1.768324
H  5.817958 1.168883 -1.737178
H  4.346228 0.919475 -2.671925
H  5.399604 -0.441417 -2.316904
H  5.399915 -1.494269 0.069915
H  4.63072 -0.595758 1.378437
H  6.034506 0.071545 0.56363
H  2.787753 2.382854 -1.890215
H  3.141069 5.606777 -0.927764
H  2.258057 4.610271 -2.088098
H  1.439424 5.284401 -0.67668
H  3.330488 4.804824 1.458461
H  1.832053 3.93614 1.709217
H  3.36764 3.079479 1.789432
H  1.400784 -3.531954 0.840025
H  0.785559 -3.962302 -0.753514
H  -1.765314 -2.975539 -1.492736
H  -0.42372 -2.145972 2.53071
H  -4.773605 -2.421123 0.780361
H  -4.386909 -2.370109 -0.928956
H  -5.335483 -0.409485 1.962831
H  -3.573793 -0.147693 -1.926901
H  -5.76514 2.016782 1.931692
H  -4.008634 2.275605 -1.963532
H  -5.108387 3.370822 -0.033382
elementType: O C H
totalener: -1079.75512091 hartree
nucrepener: 2077.29977853 hartree
electener: -3157.05489944 hartree
oneelecener: -5594.14932954 hartree
twoeener: 2437.09443009 hartree
cpcmener: -0.02574594 hartree
kineticenergy: 1074.85087698 hartree
xcener: -106.458420691446 hartree
chargesum: -0.0000000
charge: -0.284489 -0.477740 -0.277349 0.101461 0.046344 -0.104867 -0.270015 -0.274722 -0.285848 0.405798 -0.030924 -0.220786 -0.266672 0.089185 -0.087526 -0.330950 -0.010563 0.200388 -0.064926 0.048250 -0.190817 -0.193988 -0.154883 -0.158047 -0.170768 0.086608 0.087162 0.097015 0.087701 0.096693 0.097668 0.091369 0.094890 0.115745 0.093159 0.086936 0.093933 0.092236 0.103841 0.094094 0.118102 0.120187 0.160214 0.169500 0.110015 0.117101 0.139420 0.140869 0.155540 0.156932 0.157525
qa: -0.2845 -0.4777 -0.2773 0.1015 0.0463 -0.1049 -0.2700 -0.2747 -0.2858 0.4058 -0.0309 -0.2208 -0.2667 0.0892 -0.0875 -0.3310 -0.0106 0.2004 -0.0649 0.0482 -0.1908 -0.1940 -0.1549 -0.1580 -0.1708 0.0866 0.0872 0.0970 0.0877 0.0967 0.0977 0.0914 0.0949 0.1157 0.0932 0.0869 0.0939 0.0922 0.1038 0.0941 0.1181 0.1202 0.1602 0.1695 0.1100 0.1171 0.1394 0.1409 0.1555 0.1569 0.1575
va: 2.1224 2.0279 2.2832 3.6976 3.7619 3.8463 3.9117 3.9051 3.8973 4.1865 3.7395 3.9248 3.9426 3.8082 3.6309 4.0191 3.9493 3.6298 3.8192 3.5887 3.9542 3.9433 3.8967 3.9057 3.8998 1.0367 1.0363 1.0019 1.0060 1.0018 0.9997 1.0189 1.0005 1.0116 0.9960 1.0093 0.9945 0.9988 0.9945 1.0056 1.0130 0.9947 1.0072 1.0045 1.0080 1.0064 1.0050 1.0038 0.9914 0.9911 0.9904
dispcorr: -0.021660435 hartree
energy: -1079.776781349293
dipole: 21.04203 -21.08039 -0.03836 18.82529 -18.87222 -0.04693 -5.38687 4.32714 -1.05973
magnitude: 1.06146 au
magnitude: 2.69802 debye
