program: Gaussian 09
title: 000007398
version: EM64L-G09RevD.01
frameworkgroup: C1[X(C6H4Cl2O2S)]
method: RPBEPBE
basis: SDD
operation: Freq
keyword: #p
keyword: freq=noraman
keyword: PBEPBE/SDD
title: #p freq=noraman PBEPBE/SDD
converged: NO NO NO NO
title: Mulliken charges:
elementType: Cl Cl S O O C C C C C C H H H H
charge: -0.194696 -0.006037 0.898688 -0.453121 -0.453188 -0.092389 -0.197407 -0.197845 -0.172723 -0.172652 -0.102670 0.295350 0.295383 0.276660 0.276647
chargesum: 0.00000
title: Mulliken charges with hydrogens summed into heavy atoms:
elementType: Cl Cl S O O C C C C C C
charge: -0.194696 -0.006037 0.898688 -0.453121 -0.453188 -0.092389 0.097943 0.097537 0.103937 0.103995 -0.102670
polarizability: 1.78380177e+02 6.80977895e-02 1.03114959e+02 -1.88487466e+00 4.53411968e-01 8.52787357e+01
1716.lowfreq: -8.9738 -2.3359 -0.0014 0.0021 0.0023 15.7335 36.3621 52.8724 117.3322
frequency: 35.2919 52.8631 117.3321 121.3720 179.9194 208.3713 240.5276 257.6586 286.3869 361.4925 375.4013 408.2710 411.4552 486.5718 502.9980 607.3018 690.2377 703.1124 822.0987 824.4040 829.3389 958.0440 961.2230 971.7535 974.1400 1042.2198 1068.7241 1107.9515 1178.0894 1284.3832 1381.3614 1385.4245 1447.0468 1561.3065 1592.3024 3167.3458 3167.5359 3185.9062 3188.3304
redmass: 4.8779 20.0826 11.5700 11.4628 16.6804 14.5096 20.8668 9.7441 8.3343 5.7475 18.2176 2.9014 10.9373 6.6892 4.6490 7.1259 4.4084 6.3601 1.2413 16.6955 1.4363 1.3175 15.3632 1.3935 7.5341 2.5851 3.3285 1.3246 1.1273 1.2302 3.4299 7.1671 2.0859 6.1045 8.2121 1.0901 1.0898 1.0967 1.0979
irintensity: 0.0150 1.4329 2.5012 5.4513 1.1627 3.7120 0.0256 0.0142 8.2151 0.3735 69.0532 0.0024 72.0975 15.0460 92.5644 0.2839 12.5778 18.2549 0.2992 85.4683 60.0790 0.1479 54.2961 0.2331 24.8915 34.2539 74.6013 6.5566 6.9269 1.8712 22.1687 0.0011 46.6972 53.6178 1.6102 3.8732 3.3323 0.7504 2.1588
temp: 298.150 k
press: 1.00000 atm
elementType: 17 17 16 8 8 6 6 6 6 6 6 1 1 1 1
symmnumber: 1
zpe: 228160.7 jmol-1
zpe.correction: 0.086902 hartree
zpe.thermalcorrener: 0.098028 hartree
zpe.thermalcorrenthalpy: 0.098972 hartree
zpe.thermalcorrgfe: 0.047895 hartree
zpe.sumelectzpe: -1698.703947 hartree
zpe.sumelectthermal: -1698.692821 hartree
zpe.sumelectthermalent: -1698.691877 hartree
zpe.sumelectthermalfe: -1698.742954 hartree
dipole: 5.0394 0.0013 0.0049
dipole: 5.0394
quadrupole: -99.5401 -79.5192 -91.2167
quadrupole: 0.0520 -1.4758 0.3407
quadrupole: -9.4481 10.5728 -1.1247 0.0520 -1.4758 0.3407
hfenergy: -1698.790849 hartree
pointgroup: C01 [X(C6H4Cl2O2S1)]
dipole: 1.9785397 -0.0025525 0.1278166 debye
dipolederiv: -0.4388101 -0.0000963 -0.1009527 -0.0005939 -0.2282117 -0.0012984 -0.3313726 -0.0013993 -0.7689216 -0.9196015 0.0009594 0.0100421 0.0009122 -0.0900761 0.0003037 0.0346303 0.0002818 -0.037956 1.894816 -0.0005529 0.1562961 -0.0005718 0.9581654 0.0022292 0.2388448 0.0022534 1.6679786 -0.628704 0.0074542 -0.0147929 0.051129 -0.4757596 -0.145149 0.0253438 -0.0495854 -0.4885386 -0.6286411 -0.0072626 -0.0143278 -0.0503476 -0.4748026 0.1449379 0.0259243 0.049475 -0.4897547 -0.1285726 0.0002906 0.0509939 0.0013377 -0.0688008 -0.0003789 0.1776266 -0.0010072 -0.1690263 -0.0156979 -0.115046 -0.0388076 0.328798 -0.0213157 0.0104424 -0.0921989 0.0257859 -0.0797676 -0.0162267 0.1147986 -0.0400713 -0.3304756 -0.0211207 -0.0112373 -0.0890546 -0.0257592 -0.0796554 -0.4274631 0.1648232 -0.0037465 0.1305855 -0.0119416 -0.0070639 0.0274509 -0.0124267 -0.0714149 -0.4280237 -0.1638982 -0.0019102 -0.129455 -0.011227 0.0063261 0.0290318 0.011514 -0.0716973 1.4631476 -0.0015532 -0.0395912 -0.0015987 0.1828763 -0.0012503 -0.0794841 -0.0012654 -0.0508323 0.1054651 0.0582776 0.0175696 0.0233755 0.0952558 0.0069305 -0.0100628 -0.0126596 0.1488284 0.1053942 -0.0582446 0.018288 -0.0234317 0.0954937 -0.0063599 -0.0096489 0.0132774 0.1489323 0.0314003 -0.0489777 0.0007827 -0.0309912 0.0358333 0.0023617 0.0266347 0.0029341 0.1708562 0.0315174 0.0490278 0.0002279 0.0313277 0.0356313 -0.0007937 0.0263347 -0.001419 0.1709694 unknown
polarizability: 177.7352106|-0.0655496|103.1248357|7.9490257|-0.181907|85.9138254 unknown
InChI: InChI=1S/C6H4ClO2S.Cl/c7-5-1-3-6(4-2-5)10(8)9;/h1-4H;
charge 0 multiplicity 1
15 atoms
Cl -2.781525 -0.00222 -2.10226
Cl 4.20593 -0.004852 -0.132308
S  -2.211961 0.003364 0.247708
O  -2.700771 1.421231 0.855276
O  -2.705028 -1.4093 0.86394
C  -0.340511 0.000649 0.114386
C  0.311518 1.24317 0.067555
C  0.309244 -1.243513 0.081806
C  1.721846 1.235424 -0.004148
C  1.719605 -1.239103 0.01017
C  2.397576 -0.002688 -0.035557
H  -0.250501 2.180864 0.101524
H  -0.254489 -2.179732 0.126426
H  2.280031 2.174426 -0.037455
H  2.276135 -2.179419 -0.012163
