program: Orca
programVersion: 5.0.2
elementType: O O O C C C C C C C C C C C C C C C C C C C C C C H H H H H H H H H H H H H H H H H H H H H H H H H H
charge: 0
multiplicity: 1
keywords: wb97x-d3
keywords: def2-TZVPP
keywords: def2/J RIJCOSX
keywords: DEFGRID2
keywords: scfconv7
keywords: smallprint printgap noloewdin
keywords: NOSOSCF
formula: C22H26O3
InChI: InChI=1/C22H26O3/c1-15(2)10-19-20(22(19,3)4)21(23)25-14-17-12-18(24-13-17)11-16-8-6-5-7-9-16/h5-10,12-13,19-20H,11,14H2,1-4H3
51 atoms
O  1.49086 -1.433253 0.279742
O  1.444073 -1.038284 -1.919163
O  -2.784216 -1.786639 -0.605378
C  2.257273 1.857742 -1.04536
C  3.475482 1.117334 -1.478029
C  2.556299 0.488764 -0.449295
C  2.408654 3.013133 -0.086368
C  1.128726 2.050672 -2.027663
C  4.842493 1.565119 -1.104222
C  1.780702 -0.71353 -0.803393
C  5.844626 0.777878 -0.704888
C  7.193505 1.344625 -0.381054
C  5.728619 -0.706708 -0.548808
C  0.711265 -2.627624 0.105293
C  -0.74626 -2.329145 0.082285
C  -1.628003 -2.285482 1.210013
C  -1.512837 -2.017337 -0.989992
C  -2.851796 -1.957107 0.735497
C  -4.166483 -1.742144 1.392359
C  -4.570086 -0.287634 1.410967
C  -4.040653 0.574856 2.367406
C  -5.455839 0.220655 0.467664
C  -4.397476 1.914587 2.387971
C  -5.813585 1.562557 0.483887
C  -5.288027 2.412876 1.445603
H  3.393561 0.666451 -2.464598
H  2.907255 0.509261 0.576031
H  2.632203 3.936373 -0.625432
H  3.203697 2.853866 0.6424
H  1.481159 3.174119 0.466652
H  0.164084 2.105994 -1.518884
H  1.070897 1.262372 -2.774747
H  1.270437 2.993036 -2.561815
H  5.036588 2.630298 -1.201358
H  7.96708 0.906194 -1.017201
H  7.22819 2.426819 -0.507475
H  7.477941 1.116585 0.64986
H  6.47246 -1.21415 -1.169011
H  5.934637 -1.006726 0.48229
H  4.750364 -1.097113 -0.822399
H  0.956847 -3.247208 0.966505
H  1.026883 -3.162916 -0.790215
H  -1.375281 -2.484346 2.239717
H  -1.302856 -1.931304 -2.044398
H  -4.093042 -2.121452 2.412565
H  -4.936133 -2.335275 0.891106
H  -3.347061 0.192796 3.107701
H  -5.877315 -0.437967 -0.282411
H  -3.983213 2.569958 3.14352
H  -6.508648 1.942306 -0.253813
H  -5.571439 3.457148 1.463195
elementType: O C H
totalener: -1079.75330992 hartree
nucrepener: 2080.92433760 hartree
electener: -3160.67764752 hartree
oneelecener: -5601.25292377 hartree
twoeener: 2440.57527625 hartree
cpcmener: -0.02397606 hartree
kineticenergy: 1074.87874636 hartree
xcener: -106.463275241072 hartree
chargesum: 0.0000000
charge: -0.288091 -0.480334 -0.277126 0.144980 -0.007929 -0.127832 -0.283816 -0.284317 -0.292515 0.407363 -0.016338 -0.227139 -0.241856 0.089898 -0.088509 -0.328426 -0.012985 0.198676 -0.063920 0.056113 -0.197014 -0.193943 -0.157461 -0.154969 -0.171442 0.102773 0.096915 0.097077 0.092569 0.098394 0.098600 0.092996 0.094094 0.119829 0.095538 0.088971 0.093398 0.101705 0.097679 0.086721 0.117437 0.119276 0.160366 0.167714 0.115485 0.111050 0.140866 0.139283 0.157122 0.155766 0.157308
qa: -0.2881 -0.4803 -0.2771 0.1450 -0.0079 -0.1278 -0.2838 -0.2843 -0.2925 0.4074 -0.0163 -0.2271 -0.2419 0.0899 -0.0885 -0.3284 -0.0130 0.1987 -0.0639 0.0561 -0.1970 -0.1939 -0.1575 -0.1550 -0.1714 0.1028 0.0969 0.0971 0.0926 0.0984 0.0986 0.0930 0.0941 0.1198 0.0955 0.0890 0.0934 0.1017 0.0977 0.0867 0.1174 0.1193 0.1604 0.1677 0.1155 0.1110 0.1409 0.1393 0.1571 0.1558 0.1573
va: 2.1153 2.0223 2.2845 3.6964 3.8011 3.8469 3.9062 3.8948 3.8850 4.1329 3.7170 3.9300 3.9334 3.8076 3.6384 4.0250 3.9466 3.6371 3.8182 3.5762 3.9459 3.9576 3.9037 3.8973 3.9008 1.0249 1.0291 1.0008 1.0029 1.0029 0.9991 1.0199 1.0014 1.0045 0.9963 1.0067 0.9971 0.9990 0.9989 1.0106 0.9958 1.0122 1.0066 1.0073 1.0070 1.0077 1.0039 1.0059 0.9910 0.9912 0.9906
dispcorr: -0.022708623 hartree
energy: -1079.776018542226
dipole: 24.51621 -24.15437 0.36184 13.04439 -13.03343 0.01096 -0.44067 1.64735 1.20668
magnitude: 1.25981 au
magnitude: 3.20218 debye
