program: Orca
programVersion: 5.0.2
elementType: O O O C C C C C C C C C C C C C C C C C C C C C C H H H H H H H H H H H H H H H H H H H H H H H H H H
charge: 0
multiplicity: 1
keywords: wb97x-d3
keywords: def2-TZVPP
keywords: def2/J RIJCOSX
keywords: DEFGRID2
keywords: scfconv7
keywords: smallprint printgap noloewdin
keywords: NOSOSCF
formula: C22H26O3
InChI: InChI=1/C22H26O3/c1-15(2)10-19-20(22(19,3)4)21(23)25-14-17-12-18(24-13-17)11-16-8-6-5-7-9-16/h5-10,12-13,19-20H,11,14H2,1-4H3
51 atoms
O  1.657878 -2.1381 -0.172158
O  0.997148 -1.028537 -2.000436
O  -2.188671 -3.290267 1.488251
C  1.415937 1.370176 0.016408
C  2.474299 1.37792 -1.048352
C  2.208581 0.104978 -0.277154
C  1.683146 2.022101 1.3516
C  -0.028281 1.483862 -0.410353
C  3.77493 2.056204 -0.883041
C  1.559341 -1.047031 -0.930307
C  4.376826 2.846494 -1.777902
C  5.722633 3.443315 -1.493255
C  3.812627 3.199778 -3.120936
C  0.865238 -3.288121 -0.517016
C  -0.497836 -3.14159 0.060034
C  -1.558585 -2.28437 -0.378681
C  -0.94589 -3.722886 1.197988
C  -2.554873 -2.406998 0.530183
C  -3.860255 -1.70584 0.687003
C  -3.659546 -0.248292 1.032323
C  -3.074826 0.116605 2.244314
C  -4.015527 0.751643 0.134406
C  -2.851412 1.450898 2.5484
C  -3.793071 2.090282 0.436612
C  -3.209643 2.443774 1.643811
H  2.075247 1.370626 -2.056839
H  2.930966 -0.158049 0.488176
H  1.004547 1.624857 2.109492
H  1.514757 3.09954 1.292593
H  2.700046 1.863587 1.708705
H  -0.207195 1.12613 -1.422146
H  -0.334869 2.531395 -0.379464
H  -0.684158 0.930867 0.266553
H  4.292583 1.874558 0.054773
H  5.682062 4.535805 -1.512777
H  6.114329 3.138729 -0.522595
H  6.450258 3.150026 -2.255241
H  2.767473 2.924275 -3.245311
H  3.891898 4.274584 -3.297352
H  4.381325 2.714389 -3.918165
H  1.382733 -4.136342 -0.071105
H  0.84521 -3.435741 -1.596993
H  -1.572695 -1.646218 -1.247523
H  -0.506358 -4.438722 1.875747
H  -4.448692 -2.202152 1.462251
H  -4.432658 -1.787347 -0.238848
H  -2.788807 -0.649179 2.956562
H  -4.470108 0.484105 -0.812403
H  -2.396748 1.71762 3.494209
H  -4.0765 2.855771 -0.274625
H  -3.034158 3.485474 1.880367
elementType: O C H
totalener: -1079.75241529 hartree
nucrepener: 2165.33210718 hartree
electener: -3245.08452247 hartree
oneelecener: -5770.06883819 hartree
twoeener: 2524.98431572 hartree
cpcmener: -0.02459064 hartree
kineticenergy: 1074.85484642 hartree
xcener: -106.460713853816 hartree
chargesum: -0.0000000
charge: -0.281465 -0.468656 -0.273686 0.152377 0.037556 -0.101961 -0.277113 -0.288123 -0.282604 0.395396 -0.039916 -0.219147 -0.258632 0.072916 -0.074333 -0.343714 -0.036667 0.239379 -0.041062 -0.010045 -0.164903 -0.162321 -0.163908 -0.159291 -0.170167 0.089780 0.088148 0.094708 0.097507 0.090071 0.101319 0.102230 0.058526 0.114720 0.093189 0.087182 0.092208 0.091539 0.092190 0.100278 0.115205 0.118551 0.160802 0.174927 0.110276 0.103558 0.137834 0.138496 0.155629 0.155270 0.155947
qa: -0.2815 -0.4687 -0.2737 0.1524 0.0376 -0.1020 -0.2771 -0.2881 -0.2826 0.3954 -0.0399 -0.2191 -0.2586 0.0729 -0.0743 -0.3437 -0.0367 0.2394 -0.0411 -0.0100 -0.1649 -0.1623 -0.1639 -0.1593 -0.1702 0.0898 0.0881 0.0947 0.0975 0.0901 0.1013 0.1022 0.0585 0.1147 0.0932 0.0872 0.0922 0.0915 0.0922 0.1003 0.1152 0.1186 0.1608 0.1749 0.1103 0.1036 0.1378 0.1385 0.1556 0.1553 0.1559
va: 2.1182 2.0370 2.2816 3.6393 3.7814 3.8439 3.9083 3.9123 3.8877 4.2015 3.7529 3.9234 3.9428 3.8483 3.7001 3.9494 3.9563 3.6070 3.7983 3.6819 3.8866 3.8939 3.8735 3.8803 3.8594 1.0333 1.0373 1.0024 1.0015 1.0070 1.0203 1.0012 1.0076 1.0121 0.9966 1.0092 0.9953 1.0083 0.9982 0.9954 0.9972 1.0105 1.0172 0.9940 1.0136 1.0082 1.0108 1.0035 0.9922 0.9920 0.9917
dispcorr: -0.025875875 hartree
energy: -1079.778291167335
dipole: 16.11947 -16.00310 0.11637 23.21831 -22.97954 0.23877 -4.68046 5.38089 0.70043
magnitude: 0.74910 au
magnitude: 1.90407 debye
