program: Orca
programVersion: 5.0.2
elementType: O O O C C C C C C C C C C C C C C C C C C C C C C H H H H H H H H H H H H H H H H H H H H H H H H H H
charge: 0
multiplicity: 1
keywords: wb97x-d3
keywords: def2-TZVPP
keywords: def2/J RIJCOSX
keywords: DEFGRID2
keywords: scfconv7
keywords: smallprint printgap noloewdin
keywords: NOSOSCF
formula: C22H26O3
InChI: InChI=1/C22H26O3/c1-15(2)10-19-20(22(19,3)4)21(23)25-14-17-12-18(24-13-17)11-16-8-6-5-7-9-16/h5-10,12-13,19-20H,11,14H2,1-4H3
51 atoms
O  1.127077 -1.467571 -1.417121
O  0.863567 0.745176 -1.623127
O  -2.490531 -2.422438 1.032406
C  3.403874 0.663203 0.260477
C  3.770351 1.112975 -1.123527
C  2.972645 -0.156988 -0.945414
C  4.461468 0.040333 1.1385
C  2.392496 1.472398 1.034609
C  5.151699 1.026675 -1.648599
C  1.558587 -0.20941 -1.36278
C  5.916863 2.059213 -2.015803
C  7.298241 1.841915 -2.556379
C  5.496285 3.49467 -1.930773
C  -0.245562 -1.712484 -1.761731
C  -1.121323 -1.703241 -0.559857
C  -1.460174 -0.605665 0.299322
C  -1.776812 -2.774683 -0.055746
C  -2.289457 -1.101292 1.247381
C  -3.01449 -0.472347 2.382638
C  -4.46472 -0.208776 2.05273
C  -5.420601 -1.213709 2.176195
C  -4.86194 1.040132 1.584368
C  -6.745378 -0.974119 1.83783
C  -6.186401 1.283241 1.247539
C  -7.1329 0.275427 1.372592
H  3.187582 1.957191 -1.477918
H  3.513225 -1.089253 -1.071439
H  5.053692 0.814881 1.630772
H  5.14937 -0.598905 0.58583
H  4.002073 -0.569307 1.919188
H  1.809982 0.837708 1.706357
H  1.696677 2.013843 0.397082
H  2.909676 2.21134 1.650305
H  5.569522 0.027865 -1.741147
H  7.551695 0.784154 -2.629386
H  7.405246 2.282377 -3.551462
H  8.048474 2.324984 -1.924229
H  6.221202 4.069319 -1.347938
H  5.470018 3.952432 -2.923478
H  4.520152 3.639195 -1.471053
H  -0.252227 -2.700177 -2.221349
H  -0.582301 -0.994853 -2.511103
H  -1.135092 0.419076 0.22002
H  -1.825235 -3.809628 -0.358224
H  -2.512968 0.465968 2.622826
H  -2.939333 -1.107467 3.269401
H  -5.131296 -2.190503 2.546142
H  -4.128146 1.831687 1.483737
H  -7.477908 -1.764589 1.942311
H  -6.478899 2.262118 0.888895
H  -8.166771 0.463537 1.11253
elementType: O C H
totalener: -1079.75466721 hartree
nucrepener: 2042.96368846 hartree
electener: -3122.71835568 hartree
oneelecener: -5525.13104177 hartree
twoeener: 2402.41268609 hartree
cpcmener: -0.02503139 hartree
kineticenergy: 1074.85555209 hartree
xcener: -106.459349152005 hartree
chargesum: -0.0000000
charge: -0.279799 -0.475008 -0.279474 0.140899 0.022109 -0.131881 -0.261183 -0.295027 -0.280751 0.414477 -0.031990 -0.225234 -0.253789 0.072677 -0.081553 -0.310626 -0.040268 0.213712 -0.068203 0.058683 -0.201311 -0.199339 -0.154186 -0.148231 -0.174619 0.093101 0.089530 0.095792 0.087482 0.098238 0.097931 0.093764 0.097738 0.118284 0.088229 0.093319 0.093762 0.093872 0.097378 0.089712 0.114688 0.118735 0.162981 0.174247 0.107435 0.116547 0.138164 0.139826 0.156132 0.156109 0.156919
qa: -0.2798 -0.4750 -0.2795 0.1409 0.0221 -0.1319 -0.2612 -0.2950 -0.2808 0.4145 -0.0320 -0.2252 -0.2538 0.0727 -0.0816 -0.3106 -0.0403 0.2137 -0.0682 0.0587 -0.2013 -0.1993 -0.1542 -0.1482 -0.1746 0.0931 0.0895 0.0958 0.0875 0.0982 0.0979 0.0938 0.0977 0.1183 0.0882 0.0933 0.0938 0.0939 0.0974 0.0897 0.1147 0.1187 0.1630 0.1742 0.1074 0.1165 0.1382 0.1398 0.1561 0.1561 0.1569
va: 2.1241 2.0286 2.2800 3.6750 3.7645 3.8979 3.8993 3.9039 3.8763 4.1659 3.7273 3.9254 3.9450 3.8504 3.6929 4.0029 3.9709 3.6490 3.8194 3.5867 3.9619 3.9449 3.8998 3.8924 3.9049 1.0306 1.0384 1.0029 1.0047 1.0024 1.0002 1.0170 1.0022 1.0092 1.0087 0.9954 0.9965 0.9977 0.9970 1.0083 0.9985 1.0080 1.0166 0.9944 1.0108 1.0080 1.0111 1.0042 0.9910 0.9909 0.9907
dispcorr: -0.022342767 hartree
energy: -1079.777009980150
dipole: 29.80359 -29.13146 0.67213 14.27292 -14.60972 -0.33680 -1.11351 1.51170 0.39819
magnitude: 0.85073 au
magnitude: 2.16238 debye
