program: Gaussian 09
title: 000062097
version: EM64L-G09RevD.01
frameworkgroup: C1[X(C8H12INO2)]
method: RPBEPBE
basis: SDD
operation: Freq
keyword: #p
keyword: freq=noraman
keyword: PBEPBE/SDD
title: #p freq=noraman PBEPBE/SDD
converged: YES YES NO NO
title: Mulliken charges:
elementType: I O O N C C C C C C C C H H H H H H H H H H H H
charge: 0.171574 -0.299024 -0.288531 -0.367248 -0.327830 -0.352299 -0.403352 -0.684092 0.297006 -0.328435 0.374693 -0.545744 0.217269 0.195769 0.190756 0.200874 0.211914 0.254284 0.214342 0.217309 0.209240 0.326688 0.254214 0.260623
chargesum: 0.00000
title: Mulliken charges with hydrogens summed into heavy atoms:
elementType: I O O N C C C C C C C C
charge: 0.171574 -0.299024 -0.288531 -0.040560 0.085208 0.039330 0.062846 -0.043201 0.297006 0.186402 0.374693 -0.545744
polarizability: 1.93050450e+02 -1.89025126e+01 9.74239533e+01 -2.76445607e+00 7.95051057e+00 7.70659327e+01
1716.lowfreq: -20.0217 -7.4324 -0.0004 0.0001 0.0004 1.8568 2.4142 14.0258 25.7416
frequency: -14.3364 13.9791 24.2020 56.8279 61.8731 99.1954 133.0737 148.9528 157.7488 206.1983 215.2278 228.1098 285.5573 308.1793 329.5911 373.9491 468.1668 503.5373 521.9102 565.2558 676.3380 694.8893 737.8394 812.6967 841.4603 878.8333 916.2220 970.1942 973.6168 989.2294 1051.4943 1059.0269 1108.8265 1122.0888 1137.2883 1191.7659 1194.7161 1228.9869 1263.3839 1286.5516 1311.2178 1342.9958 1350.7176 1367.7703 1390.9876 1455.6929 1457.5077 1458.6310 1472.5350 1476.3431 1484.5567 1491.7304 1673.1881 2238.8480 2961.0720 2974.1613 2976.7371 2993.9290 2995.4420 3007.0246 3043.3922 3048.2331 3070.9196 3074.5871 3076.1537 3574.9100
redmass: 3.9154 4.7186 3.7002 2.4092 3.8761 3.6819 4.7675 3.3717 5.5355 4.9431 1.4319 2.7805 2.7742 4.1564 5.7149 4.5337 3.6407 4.0000 3.3354 1.2458 4.6540 10.3798 1.2086 1.9835 1.9435 3.4430 2.3391 1.5994 1.6121 2.9068 2.8856 4.3525 3.3773 2.3198 1.9500 1.1660 1.8099 1.3365 1.3333 1.1001 1.2497 1.3347 1.5105 1.3205 1.2114 1.0786 1.1018 1.0779 1.0664 1.0426 1.0841 1.7713 9.4373 11.8348 1.0591 1.0399 1.0572 1.0664 1.0564 1.0974 1.1007 1.1048 1.1005 1.0996 1.1003 1.0773
irintensity: 0.0792 2.1344 0.4229 2.6128 2.0013 3.9598 0.7179 16.5709 3.9924 1.6071 0.8057 9.0798 7.8808 5.4135 1.6601 11.8755 0.6920 3.6989 11.5482 131.5100 12.4912 17.7348 10.8357 13.7243 2.4325 10.8872 68.2140 12.2183 13.3337 138.6673 8.7898 136.2060 91.3168 43.8494 4.2272 56.5198 246.9606 19.9128 63.8052 0.2400 41.5543 29.2731 6.1020 1.7630 9.3584 9.4660 21.6282 21.7578 11.0741 9.8841 23.4268 313.4083 301.7449 44.2125 25.6493 20.5922 62.0069 41.0770 12.5851 3.6211 47.6233 10.3381 77.6803 30.5515 33.3510 31.6375
temp: 298.150 k
press: 1.00000 atm
elementType: 53 8 8 7 6 6 6 6 6 6 6 6 1 1 1 1 1 1 1 1 1 1 1 1
symmnumber: 1
zpe: 494095.2 jmol-1
zpe.correction: 0.188191 hartree
zpe.thermalcorrener: 0.202172 hartree
zpe.thermalcorrenthalpy: 0.203116 hartree
zpe.thermalcorrgfe: 0.142539 hartree
zpe.sumelectzpe: -527.753696 hartree
zpe.sumelectthermal: -527.739715 hartree
zpe.sumelectthermalent: -527.738771 hartree
zpe.sumelectthermalfe: -527.799348 hartree
dipole: 0.7222 2.0117 1.1051
dipole: 2.4062
quadrupole: -67.4438 -90.8363 -85.0110
quadrupole: 4.7230 5.4752 -0.4939
quadrupole: 13.6532 -9.7393 -3.9140 4.7230 5.4752 -0.4939
hfenergy: -527.9418868 hartree
pointgroup: C01 [X(C8H12I1N1O2)]
dipole: -0.3825857 0.731311 -0.4636756 debye
dipolederiv: -0.0194088 -0.0958899 0.0333346 -0.1176429 0.1331577 0.0240224 0.0496312 0.0276299 0.1801688 -2.0974686 -0.3270269 -0.1315088 -0.464741 -0.4897698 0.0268434 -0.2014262 0.0322511 -0.3596592 -0.8205635 -0.0820424 -0.0301257 -0.043614 -0.8852961 0.3069048 -0.099516 0.3368014 -0.5533506 -1.454328 0.2299743 -0.1743983 0.3595755 -0.4851226 0.036958 -0.4287302 0.0486153 -0.6265017 0.0170742 0.0579461 0.0393443 0.0209075 0.0494362 -0.0438112 0.0708407 -0.0319711 0.0363726 0.0958988 0.0313886 0.0726131 0.014099 0.0532146 -0.0165909 0.1035351 -0.0158241 0.1163046 0.7970757 -0.0394967 0.0316032 0.2424442 0.088421 0.1025421 -0.0456292 0.0511108 0.2912993 0.0403968 0.0507575 0.0447561 0.0721191 0.0151948 -0.038886 0.0285132 -0.0222598 0.0465554 2.5311792 0.0939822 0.3683589 0.2063256 1.209956 -0.5030686 0.5355478 -0.5836297 0.7290557 1.429072 0.2157459 0.0572814 -0.1398783 0.3194402 -0.0120929 0.3421417 0.0570587 0.4021991 -0.4325718 -0.1576575 0.0372836 -0.2531671 -0.127417 0.0596817 0.1164321 0.080939 -0.0376205 0.1839234 0.2536155 -0.1015021 0.2782614 -0.1420783 -0.0751697 -0.1209964 -0.0786305 -0.2660964 0.0718582 0.0247607 -0.073517 0.0272076 0.0301543 0.0028026 -0.0532963 0.0266083 -0.1319346 -0.2007212 -0.1036653 -0.0041173 -0.0608308 -0.0108633 -0.0021674 0.003283 -0.0144721 0.0857167 0.047191 0.0269215 -0.0568276 0.0143685 0.0346552 -0.0085677 -0.0587326 0.0299567 -0.2033816 -0.1545138 -0.1082602 0.0180882 -0.1096737 0.0058472 -0.0008366 -0.0028785 -0.0013124 0.0610829 -0.0830954 0.0007832 -0.0645089 -0.0052114 0.1103077 0.0450848 -0.078462 -0.0162132 -0.1524178 0.0494469 0.0636031 0.0100585 -0.0171365 -0.0799161 -0.0158106 0.0531823 0.0364422 0.0981133 0.0523879 0.0148466 -0.0865952 0.0097831 0.0927506 0.0382934 -0.0381083 -0.0090401 -0.1588735 0.0665531 0.0406912 0.0151991 0.0900844 -0.1988052 0.0265705 0.008954 0.0535192 0.0750691 -0.148824 -0.0701527 0.0102846 -0.1334589 0.0377184 -0.0128829 -0.0109951 -0.0309629 0.074923 0.1882107 -0.025492 -0.0642352 -0.1116772 0.1948637 0.078488 -0.0550978 0.0807072 0.3004558 -0.1012811 -0.0453925 0.0533636 0.043826 0.091479 -0.0048337 -0.0523246 0.0002965 -0.0826222 -0.0574916 -0.0499402 -0.0042332 0.07803 -0.0473282 -0.0134734 -0.0658678 -0.0576204 0.0751417 unknown
polarizability: 187.5396702|28.3157|101.6594525|-6.7853962|-10.4071538|78.3412132 unknown
InChI: InChI=1S/C8H12INO2/c1-2-3-6-10-8(11)12-7-4-5-9/h10H,2-3,6-7H2,1H3
charge 0 multiplicity 1
24 atoms
I  6.132669 1.403518 -0.382698
O  0.994725 -0.261497 -0.176557
O  -0.353651 -2.033419 0.620444
N  -1.191826 -0.348665 -0.7977
C  -3.538957 -0.093701 0.109024
C  -3.70662 1.407862 -0.215349
C  -2.579655 -0.839854 -0.847961
C  -4.706763 2.110863 0.727807
C  -0.224184 -0.981022 -0.05822
C  2.119135 -0.876854 0.586292
C  3.345982 -0.147572 0.265827
C  4.403172 0.44037 0.023292
H  -3.17689 -0.216241 1.148532
H  -4.528656 -0.592174 0.055506
H  -4.046252 1.520401 -1.266121
H  -2.722437 1.913671 -0.143204
H  -2.94266 -0.751005 -1.890474
H  -2.550128 -1.91204 -0.587619
H  -4.377006 2.034222 1.780805
H  -4.808629 3.18375 0.482434
H  -5.710156 1.650363 0.656522
H  -0.928036 0.508089 -1.284803
H  1.888397 -0.823503 1.667194
H  2.196426 -1.945662 0.311826
