program: Orca
programVersion: 5.0.2
elementType: O O O C C C C C C C C C C C C C C C C C C C C C C H H H H H H H H H H H H H H H H H H H H H H H H H H
charge: 0
multiplicity: 1
keywords: wb97x-d3
keywords: def2-TZVPP
keywords: def2/J RIJCOSX
keywords: DEFGRID2
keywords: scfconv7
keywords: smallprint printgap noloewdin
keywords: NOSOSCF
formula: C22H26O3
InChI: InChI=1/C22H26O3/c1-15(2)10-19-20(22(19,3)4)21(23)25-14-17-12-18(24-13-17)11-16-8-6-5-7-9-16/h5-10,12-13,19-20H,11,14H2,1-4H3
51 atoms
O  1.877215 -2.282991 0.376315
O  1.469136 -1.635728 -1.724211
O  -2.4254 -2.71643 -0.335642
C  1.370074 1.109184 -0.131139
C  2.517621 1.070634 -1.099657
C  2.336429 -0.069481 -0.137005
C  1.454797 2.027903 1.061749
C  -0.03395 0.958587 -0.663394
C  3.689563 1.970524 -0.963508
C  1.862396 -1.384815 -0.609931
C  3.881855 3.085016 -1.67462
C  5.106038 3.928438 -1.48627
C  2.913354 3.590527 -2.699449
C  1.114203 -3.486124 0.184717
C  -0.334791 -3.16141 0.25163
C  -1.030557 -2.613154 1.377445
C  -1.235838 -3.192793 -0.756427
C  -2.292992 -2.35705 0.963091
C  -3.449477 -1.6844 1.613302
C  -3.410361 -0.19382 1.366327
C  -2.818306 0.656938 2.295563
C  -3.906708 0.346999 0.183299
C  -2.724935 2.020294 2.051108
C  -3.814059 1.709988 -0.064024
C  -3.222217 2.551249 0.868954
H  2.22388 0.843161 -2.120432
H  3.004439 -0.108586 0.71781
H  1.152732 3.04079 0.785373
H  2.459896 2.086925 1.47813
H  0.785803 1.690037 1.855789
H  -0.088986 0.361296 -1.571017
H  -0.441783 1.943485 -0.900167
H  -0.691307 0.502145 0.080029
H  4.439691 1.69318 -0.228035
H  5.774118 3.522511 -0.72642
H  5.671173 4.016126 -2.418303
H  4.84053 4.947289 -1.191441
H  3.38632 3.663827 -3.682515
H  2.026221 2.967826 -2.80114
H  2.579109 4.599889 -2.445033
H  1.418883 -4.136397 1.003354
H  1.377386 -3.978758 -0.752277
H  -0.631481 -2.421194 2.36156
H  -1.175591 -3.518258 -1.783282
H  -3.40967 -1.883986 2.684695
H  -4.386315 -2.108359 1.244884
H  -2.424651 0.249421 3.219652
H  -4.372448 -0.300042 -0.551057
H  -2.263769 2.667957 2.786132
H  -4.20706 2.116068 -0.987522
H  -3.150962 3.614146 0.676762
elementType: O C H
totalener: -1079.75206701 hartree
nucrepener: 2197.95549544 hartree
electener: -3277.70756245 hartree
oneelecener: -5835.46206138 hartree
twoeener: 2557.75449893 hartree
cpcmener: -0.02523243 hartree
kineticenergy: 1074.87062503 hartree
xcener: -106.463406949857 hartree
chargesum: -0.0000000
charge: -0.284987 -0.456710 -0.273263 0.213359 -0.022804 -0.118364 -0.283498 -0.294951 -0.267636 0.368456 -0.029790 -0.229207 -0.250286 0.093569 -0.057428 -0.350444 -0.030278 0.213328 -0.062051 0.041244 -0.169723 -0.186684 -0.169894 -0.154209 -0.171248 0.096636 0.093182 0.097362 0.094925 0.094009 0.101720 0.104473 0.048662 0.118891 0.088868 0.093984 0.092679 0.098512 0.086994 0.094967 0.120380 0.115537 0.157228 0.171980 0.108438 0.112444 0.136350 0.137769 0.156247 0.155083 0.156176
qa: -0.2850 -0.4567 -0.2733 0.2134 -0.0228 -0.1184 -0.2835 -0.2950 -0.2676 0.3685 -0.0298 -0.2292 -0.2503 0.0936 -0.0574 -0.3504 -0.0303 0.2133 -0.0621 0.0412 -0.1697 -0.1867 -0.1699 -0.1542 -0.1712 0.0966 0.0932 0.0974 0.0949 0.0940 0.1017 0.1045 0.0487 0.1189 0.0889 0.0940 0.0927 0.0985 0.0870 0.0950 0.1204 0.1155 0.1572 0.1720 0.1084 0.1124 0.1363 0.1378 0.1562 0.1551 0.1562
va: 2.1056 2.0495 2.2714 3.5960 3.8124 3.8663 3.9055 3.9033 3.8673 4.2516 3.7062 3.9289 3.9411 3.8415 3.6363 3.9715 3.9532 3.6055 3.8167 3.6020 3.8799 3.9294 3.8646 3.8876 3.8598 1.0259 1.0358 1.0018 1.0045 1.0046 1.0243 1.0006 1.0105 1.0079 1.0078 0.9954 0.9964 0.9983 1.0091 0.9978 0.9916 1.0090 1.0113 0.9991 1.0108 1.0130 1.0044 1.0102 0.9916 0.9916 0.9916
dispcorr: -0.027579980 hartree
energy: -1079.779646991015
dipole: 12.73406 -12.81427 -0.08021 24.15859 -23.64445 0.51414 -2.58045 3.69510 1.11465
magnitude: 1.23013 au
magnitude: 3.12673 debye
