program: Gaussian 09
title: 000062095
version: EM64L-G09RevD.01
frameworkgroup: C1[X(C10H16O)]
method: RPBEPBE
basis: SDD
operation: Freq
keyword: #pfreq=noraman
keyword: PBEPBE/SDD
title: #p freq=noraman PBEPBE/SDD
converged: YES YES NO NO
title: Mulliken charges:
elementType: O C C C C C C C C C C H H H H H H H H H H H H H H H H
charge: -0.196506 -0.240716 -0.047464 -0.181635 -0.476760 -0.496438 -0.759496 0.467807 -0.115944 -0.831063 -0.723198 0.269290 0.226216 0.229333 0.221391 0.219383 0.221779 0.226750 0.219858 0.226358 0.217794 0.185222 0.217024 0.257398 0.225428 0.218038 0.220151
chargesum: 0.00000
title: Mulliken charges with hydrogens summed into heavy atoms:
elementType: O C C C C C C C C C C
charge: -0.196506 0.028574 0.178753 0.047697 -0.035985 -0.047909 -0.095487 0.467807 0.069278 -0.131213 -0.285009
polarizability: 1.17700269e+02 4.82098613e-01 1.06092851e+02 7.41036715e+00 7.09601281e+00 9.13763909e+01
1716.lowfreq: -12.4368 -0.0004 0.0007 0.0009 11.0235 21.3082 55.5154 61.1103 80.4782
frequency: 55.4636 60.7384 80.3831 93.6723 152.0090 193.9398 210.5018 224.1681 240.0067 305.1564 324.7695 378.6873 417.8148 435.7705 482.2393 534.7058 581.9353 602.1036 714.7389 794.2389 822.5071 842.4065 897.0652 917.5010 933.3205 942.5780 970.1416 983.6425 1005.0984 1014.6490 1016.4744 1038.7588 1059.8344 1072.8014 1131.1059 1147.5329 1177.9491 1190.5910 1236.7029 1241.9586 1252.7906 1268.7333 1279.7897 1283.9280 1324.1187 1337.6312 1349.5568 1394.9155 1395.2793 1397.9576 1426.1064 1465.5040 1470.8321 1475.8390 1478.5945 1480.4215 1489.7616 1636.6749 1664.1972 2866.5849 2932.2005 2964.9168 2968.2364 2973.9742 2991.2603 3008.1152 3039.5974 3041.8506 3046.6895 3066.3393 3072.1260 3074.4010 3086.4014 3098.2667 3197.5641
redmass: 6.4447 2.6111 3.0647 2.3273 2.9023 1.2144 1.8173 1.9045 1.2978 2.5453 3.2912 2.6887 3.2923 3.7393 2.4996 2.6983 2.8514 2.2405 1.2138 2.6483 1.3989 3.0278 2.5201 1.9502 1.3301 1.4912 1.9303 1.7876 1.6296 1.6556 1.8241 1.4446 1.6279 3.2757 2.7829 2.3774 1.6197 1.3989 1.3937 1.1842 1.3380 1.3481 1.4260 1.5053 1.4437 1.7271 1.5908 1.2405 1.2183 1.2197 1.1902 1.0486 1.0724 1.0521 1.0540 1.0537 1.0880 7.4353 4.9775 1.0842 1.0820 1.0379 1.0844 1.0362 1.0607 1.0628 1.0924 1.0912 1.1021 1.0999 1.1003 1.1015 1.0982 1.0627 1.1133
irintensity: 6.5455 1.1128 0.9795 0.3325 0.3383 0.6868 0.6079 3.3286 0.5560 1.4842 0.4471 8.4970 4.7651 4.4261 7.6892 3.8256 1.0118 1.9359 0.5425 0.1964 1.4509 1.4441 0.3323 1.1760 67.4265 6.8466 6.1730 1.4610 3.2624 9.3260 2.4106 3.8340 2.8685 6.4540 0.6970 18.7237 5.9823 5.8859 5.1108 2.5588 3.7424 4.9514 4.2122 7.2832 3.5892 0.5111 3.0084 11.4708 13.5253 15.8465 1.4446 17.0007 6.4962 4.1225 6.8727 21.6791 8.3609 139.6991 27.4935 71.0929 16.7438 25.4542 19.0649 26.7330 33.6682 41.3170 21.0093 12.8308 1.9335 23.9701 51.2766 58.3116 29.7056 7.8938 23.3512
temp: 298.150 k
press: 1.00000 atm
elementType: 8 6 6 6 6 6 6 6 6 6 6 1 1 1 1 1 1 1 1 1 1 1 1 1 1 1 1
symmnumber: 1
zpe: 615041.0 jmol-1
zpe.correction: 0.234257 hartree
zpe.thermalcorrener: 0.246546 hartree
zpe.thermalcorrenthalpy: 0.247491 hartree
zpe.thermalcorrgfe: 0.195830 hartree
zpe.sumelectzpe: -464.983021 hartree
zpe.sumelectthermal: -464.970732 hartree
zpe.sumelectthermalent: -464.969787 hartree
zpe.sumelectthermalfe: -465.021448 hartree
dipole: 0.8494 -2.9854 1.3063
dipole: 3.3676
quadrupole: -65.8742 -77.6213 -66.7011
quadrupole: -1.9851 0.0463 4.0535
quadrupole: 4.1913 -7.5557 3.3644 -1.9851 0.0463 4.0535
hfenergy: -465.217278 hartree
pointgroup: C01 [X(C10H16O1)]
dipole: -0.3075944 -1.2135853 -0.4336 debye
polarizability: 117.6091446|0.325384|105.0548025|7.7247173|-7.8877702|92.5055631 unknown
InChI: InChI=1S/C10H16O/c1-7(2)9-5-4-8(3)10(9)6-11/h6,8-10H,1,4-5H2,2-3H3
charge 0 multiplicity 1
27 atoms
O  -0.286294 2.53492 0.710137
C  -0.505604 0.41349 -0.505081
C  -1.826499 -0.424232 -0.581704
C  0.58641 -0.720776 -0.437196
C  -1.584429 -1.627037 0.385693
C  -0.034826 -1.785215 0.515313
C  -3.124514 0.361121 -0.314443
C  2.003873 -0.236945 -0.133797
C  -0.453517 1.29016 0.731507
C  2.523261 0.870357 -1.038783
C  2.780669 -0.771065 0.846485
H  -0.382665 1.064318 -1.389056
H  -1.866055 -0.82022 -1.618033
H  0.605803 -1.150964 -1.464119
H  -2.068228 -2.543596 0.003693
H  -2.038366 -1.416333 1.372619
H  0.281426 -1.595042 1.557282
H  0.311655 -2.800847 0.25618
H  -3.148014 0.767986 0.714159
H  -3.235142 1.210927 -1.01285
H  -4.007788 -0.293067 -0.43386
H  -0.569303 0.756321 1.709936
H  2.409666 0.595999 -2.10645
H  1.960486 1.811396 -0.88561
H  3.589909 1.078456 -0.849399
H  3.802046 -0.411106 1.016919
H  2.434241 -1.577508 1.501056
