program: Orca
programVersion: 5.0.2
elementType: O O O C C C C C C C C C C C C C C C C C C C C C C H H H H H H H H H H H H H H H H H H H H H H H H H H
charge: 0
multiplicity: 1
keywords: wb97x-d3
keywords: def2-TZVPP
keywords: def2/J RIJCOSX
keywords: DEFGRID2
keywords: scfconv7
keywords: smallprint printgap noloewdin
keywords: NOSOSCF
formula: C22H26O3
InChI: InChI=1/C22H26O3/c1-15(2)10-19-20(22(19,3)4)21(23)25-14-17-12-18(24-13-17)11-16-8-6-5-7-9-16/h5-10,12-13,19-20H,11,14H2,1-4H3
51 atoms
O  1.823939 -2.026686 -0.342552
O  2.198517 -0.806376 1.494573
O  -2.463337 -1.133848 -0.918746
C  4.796424 0.1398 0.027366
C  3.689212 1.071629 -0.317242
C  3.486049 -0.42972 -0.488533
C  5.959293 0.007036 -0.926931
C  5.201187 -0.017072 1.472833
C  3.700434 1.955302 -1.510769
C  2.46723 -1.084837 0.348195
C  2.609612 2.299196 -2.201418
C  2.685846 3.214565 -3.384122
C  1.237691 1.795581 -1.869801
C  0.66142 -2.634848 0.243348
C  -0.550006 -1.813225 -0.019882
C  -0.9153 -0.549005 0.551563
C  -1.530291 -2.107021 -0.90566
C  -2.079768 -0.184064 -0.033337
C  -2.976899 0.984481 0.153627
C  -4.248163 0.608477 0.877203
C  -4.215395 0.321533 2.240138
C  -5.458644 0.513455 0.200471
C  -5.369675 -0.048128 2.913182
C  -6.617444 0.141656 0.871911
C  -6.576222 -0.140159 2.229493
H  3.163458 1.473939 0.545899
H  3.517597 -0.786895 -1.511403
H  5.655258 0.068636 -1.972227
H  6.461374 -0.952331 -0.786941
H  6.697072 0.792274 -0.748382
H  5.556964 -1.029078 1.676394
H  4.397033 0.204109 2.170209
H  6.022163 0.667884 1.695217
H  4.660978 2.359041 -1.819264
H  3.709708 3.511591 -3.611553
H  2.265684 2.739985 -4.275092
H  2.101123 4.122667 -3.214722
H  0.888644 1.092686 -2.631893
H  1.182929 1.290939 -0.907007
H  0.515691 2.615767 -1.855147
H  0.812885 -2.807175 1.309421
H  0.572747 -3.605911 -0.242176
H  -0.385747 0.011887 1.304484
H  -1.686194 -2.942631 -1.570836
H  -3.216133 1.434578 -0.813466
H  -2.428329 1.736562 0.723511
H  -3.276831 0.388009 2.779014
H  -5.499203 0.733888 -0.859866
H  -5.328358 -0.263942 3.973364
H  -7.552983 0.072714 0.331282
H  -7.478111 -0.429143 2.7539
elementType: O C H
totalener: -1079.75236132 hartree
nucrepener: 2106.22849008 hartree
electener: -3185.98085140 hartree
oneelecener: -5651.64104567 hartree
twoeener: 2465.66019427 hartree
cpcmener: -0.02395833 hartree
kineticenergy: 1074.86483096 hartree
xcener: -106.461153097977 hartree
chargesum: -0.0000000
charge: -0.285623 -0.479938 -0.279567 0.172948 -0.025965 -0.107018 -0.288717 -0.282328 -0.300110 0.393914 -0.000400 -0.229499 -0.233169 0.075705 -0.063591 -0.361222 -0.039410 0.231982 -0.051743 0.039812 -0.192823 -0.191623 -0.160880 -0.155968 -0.169227 0.103686 0.089875 0.091720 0.097064 0.098438 0.098585 0.092354 0.092207 0.121194 0.089003 0.094202 0.096066 0.103826 0.068051 0.100380 0.116632 0.115925 0.162594 0.174930 0.108832 0.116610 0.143153 0.138893 0.156661 0.155764 0.157816
qa: -0.2856 -0.4799 -0.2796 0.1729 -0.0260 -0.1070 -0.2887 -0.2823 -0.3001 0.3939 -0.0004 -0.2295 -0.2332 0.0757 -0.0636 -0.3612 -0.0394 0.2320 -0.0517 0.0398 -0.1928 -0.1916 -0.1609 -0.1560 -0.1692 0.1037 0.0899 0.0917 0.0971 0.0984 0.0986 0.0924 0.0922 0.1212 0.0890 0.0942 0.0961 0.1038 0.0681 0.1004 0.1166 0.1159 0.1626 0.1749 0.1088 0.1166 0.1432 0.1389 0.1567 0.1558 0.1578
va: 2.1081 2.0178 2.2796 3.6799 3.8273 3.8181 3.9133 3.8851 3.8940 4.1456 3.7223 3.9316 3.9365 3.8518 3.6620 3.9767 3.9746 3.6091 3.8051 3.6104 3.9388 3.9548 3.9115 3.8979 3.8989 1.0248 1.0348 1.0016 1.0032 0.9995 0.9992 1.0207 1.0010 1.0042 1.0061 0.9959 0.9962 0.9972 1.0151 1.0017 1.0102 0.9975 1.0211 0.9946 1.0100 1.0075 1.0034 1.0050 0.9916 0.9914 0.9903
dispcorr: -0.024211210 hartree
energy: -1079.776572526430
dipole: 20.18696 -20.10048 0.08647 11.83368 -11.70852 0.12515 -7.21508 6.28776 -0.92732
magnitude: 0.93971 au
magnitude: 2.38855 debye
