program: Orca
programVersion: 5.0.2
elementType: O O O C C C C C C C C C C C C C C C C C C C C C C H H H H H H H H H H H H H H H H H H H H H H H H H H
charge: 0
multiplicity: 1
keywords: wb97x-d3
keywords: def2-TZVPP
keywords: def2/J RIJCOSX
keywords: DEFGRID2
keywords: scfconv7
keywords: smallprint printgap noloewdin
keywords: NOSOSCF
formula: C22H26O3
InChI: InChI=1/C22H26O3/c1-15(2)10-19-20(22(19,3)4)21(23)25-14-17-12-18(24-13-17)11-16-8-6-5-7-9-16/h5-10,12-13,19-20H,11,14H2,1-4H3
51 atoms
O  1.224543 -0.855257 1.244555
O  1.980327 -1.701184 -0.681171
O  -2.311374 -2.785606 -0.662649
C  2.331806 1.348266 -1.364881
C  3.659857 0.73754 -1.027375
C  2.496292 0.557307 -0.077268
C  2.150281 2.838066 -1.203143
C  1.54169 0.782014 -2.518498
C  4.814455 1.555699 -0.594342
C  1.893057 -0.778329 0.094541
C  5.992437 1.65492 -1.217925
C  7.080407 2.528688 -0.66846
C  6.339934 0.945106 -2.490405
C  0.526918 -2.076585 1.535442
C  -0.75363 -2.163102 0.786754
C  -1.924174 -1.358247 0.983828
C  -1.051975 -3.002564 -0.230301
C  -2.836666 -1.777935 0.076225
C  -4.229873 -1.364393 -0.246536
C  -4.706039 -0.274357 0.673658
C  -5.418028 -0.582789 1.828805
C  -4.414328 1.059591 0.401735
C  -5.837262 0.420167 2.692564
C  -4.829177 2.064621 1.264444
C  -5.543334 1.747575 2.412509
H  3.899171 -0.148457 -1.606812
H  2.514996 1.159268 0.825232
H  2.514151 3.36319 -2.089069
H  2.682111 3.240245 -0.341707
H  1.094063 3.087006 -1.083383
H  1.781803 1.332374 -3.430645
H  0.46803 0.88694 -2.346831
H  1.74927 -0.268028 -2.710251
H  4.676936 2.131747 0.316533
H  6.785667 3.020721 0.258635
H  7.987971 1.952302 -0.469306
H  7.360313 3.304572 -1.386436
H  7.22754 0.320934 -2.357108
H  5.541227 0.311945 -2.872209
H  6.588336 1.66688 -3.27341
H  0.345896 -2.034802 2.60898
H  1.161199 -2.941935 1.337488
H  -2.054732 -0.575689 1.714812
H  -0.492061 -3.780297 -0.726574
H  -4.895128 -2.230118 -0.174331
H  -4.279404 -1.026005 -1.286442
H  -5.649824 -1.617487 2.053823
H  -3.85839 1.314674 -0.493218
H  -6.395635 0.163769 3.584056
H  -4.597301 3.097718 1.038107
H  -5.871484 2.531394 3.083235
elementType: O C H
totalener: -1079.75523603 hartree
nucrepener: 2064.72504441 hartree
electener: -3144.48028044 hartree
oneelecener: -5568.69258867 hartree
twoeener: 2424.21230823 hartree
cpcmener: -0.02468875 hartree
kineticenergy: 1074.85343580 hartree
xcener: -106.460473365750 hartree
chargesum: -0.0000000
charge: -0.285552 -0.473552 -0.280849 0.126353 0.025011 -0.123916 -0.263235 -0.283410 -0.276076 0.405699 -0.038555 -0.223423 -0.251524 0.091343 -0.103771 -0.298144 -0.019672 0.174478 -0.000890 0.000166 -0.185802 -0.193016 -0.155991 -0.154946 -0.164597 0.092376 0.087497 0.096020 0.087562 0.097927 0.094705 0.098453 0.093589 0.117949 0.088819 0.093359 0.092964 0.095242 0.089794 0.095112 0.120304 0.117089 0.159767 0.172646 0.103962 0.107079 0.138329 0.142307 0.156954 0.156084 0.157982
qa: -0.2856 -0.4736 -0.2808 0.1264 0.0250 -0.1239 -0.2632 -0.2834 -0.2761 0.4057 -0.0386 -0.2234 -0.2515 0.0913 -0.1038 -0.2981 -0.0197 0.1745 -0.0009 0.0002 -0.1858 -0.1930 -0.1560 -0.1549 -0.1646 0.0924 0.0875 0.0960 0.0876 0.0979 0.0947 0.0985 0.0936 0.1179 0.0888 0.0934 0.0930 0.0952 0.0898 0.0951 0.1203 0.1171 0.1598 0.1726 0.1040 0.1071 0.1383 0.1423 0.1570 0.1561 0.1580
va: 2.1207 2.0333 2.2744 3.6862 3.7678 3.8901 3.9044 3.9013 3.8696 4.1699 3.7368 3.9240 3.9443 3.8341 3.6779 3.9778 3.9593 3.6836 3.8194 3.6325 3.9347 3.9269 3.8992 3.8990 3.8942 1.0326 1.0387 1.0030 1.0047 1.0025 1.0010 0.9994 1.0198 1.0090 1.0086 0.9961 0.9963 0.9973 1.0092 0.9973 0.9906 1.0092 1.0044 1.0002 1.0080 1.0049 1.0045 1.0036 0.9909 0.9914 0.9902
dispcorr: -0.022255447 hartree
energy: -1079.777491476295
dipole: 24.08433 -24.23117 -0.14684 17.68077 -16.78782 0.89294 -9.35471 9.81587 0.46116
magnitude: 1.01567 au
magnitude: 2.58162 debye
