program: Orca
programVersion: 5.0.2
elementType: O O O C C C C C C C C C C C C C C C C C C C C C C H H H H H H H H H H H H H H H H H H H H H H H H H H
charge: 0
multiplicity: 1
keywords: wb97x-d3
keywords: def2-TZVPP
keywords: def2/J RIJCOSX
keywords: DEFGRID2
keywords: scfconv7
keywords: smallprint printgap noloewdin
keywords: NOSOSCF
formula: C22H26O3
InChI: InChI=1/C22H26O3/c1-15(2)10-19-20(22(19,3)4)21(23)25-14-17-12-18(24-13-17)11-16-8-6-5-7-9-16/h5-10,12-13,19-20H,11,14H2,1-4H3
51 atoms
O  1.263162 -0.68685 1.178839
O  2.057264 -1.698201 -0.649905
O  -2.299588 -2.726971 -0.508242
C  2.377057 1.294743 -1.587799
C  3.710666 0.724865 -1.20728
C  2.553619 0.608008 -0.242172
C  2.183787 2.790663 -1.539986
C  1.599528 0.632128 -2.697535
C  4.865884 1.584165 -0.854637
C  1.952446 -0.710378 0.039092
C  5.958165 1.763488 -1.603796
C  7.07601 2.650516 -1.144399
C  6.170574 1.127378 -2.94338
C  0.585459 -1.888836 1.580997
C  -0.720984 -2.040933 0.888399
C  -1.936551 -1.334605 1.172117
C  -1.008265 -2.865274 -0.1451
C  -2.860994 -1.791188 0.294428
C  -4.301072 -1.49034 0.064923
C  -4.794748 -0.408852 0.986051
C  -4.526476 0.92951 0.708624
C  -5.502544 -0.7244 2.141302
C  -4.95753 1.930333 1.567158
C  -5.938798 0.275302 3.00146
C  -5.666405 1.605805 2.716997
H  3.955076 -0.200693 -1.720009
H  2.569217 1.282835 0.60736
H  2.574751 3.255896 -2.447754
H  2.684041 3.255375 -0.690547
H  1.122536 3.039247 -1.473436
H  1.839666 1.114492 -3.647591
H  0.523212 0.73412 -2.542282
H  1.823879 -0.426557 -2.807609
H  4.806089 2.112055 0.093114
H  6.87568 3.098172 -0.17076
H  8.01439 2.093892 -1.071051
H  7.253965 3.460151 -1.857376
H  6.293401 1.894539 -3.712828
H  7.088932 0.53437 -2.953139
H  5.351978 0.481188 -3.255451
H  0.439813 -1.772635 2.654233
H  1.221461 -2.760427 1.422431
H  -2.088074 -0.592125 1.940083
H  -0.420684 -3.582279 -0.697507
H  -4.892304 -2.399865 0.208626
H  -4.449201 -1.191779 -0.977744
H  -3.975618 1.190592 -0.187776
H  -5.718556 -1.761607 2.370224
H  -4.742761 2.966187 1.336685
H  -6.49356 0.012928 3.893477
H  -6.006092 2.386653 3.385406
elementType: O C H
totalener: -1079.75494389 hartree
nucrepener: 2054.93238068 hartree
electener: -3134.68732457 hartree
oneelecener: -5549.06670213 hartree
twoeener: 2414.37937756 hartree
cpcmener: -0.02414086 hartree
kineticenergy: 1074.84646647 hartree
xcener: -106.458585018268 hartree
chargesum: -0.0000000
charge: -0.285152 -0.474491 -0.280068 0.148961 0.002393 -0.137418 -0.262157 -0.292907 -0.268420 0.410020 -0.032674 -0.227171 -0.251636 0.089370 -0.107375 -0.291267 -0.016849 0.174392 -0.003494 0.001514 -0.199311 -0.182382 -0.152030 -0.155965 -0.166173 0.094893 0.089312 0.094849 0.088588 0.097712 0.095406 0.099397 0.093058 0.118974 0.088659 0.094183 0.093073 0.095425 0.096263 0.088335 0.119359 0.117722 0.160503 0.171199 0.101483 0.109173 0.143120 0.138272 0.156265 0.157000 0.158073
qa: -0.2852 -0.4745 -0.2801 0.1490 0.0024 -0.1374 -0.2622 -0.2929 -0.2684 0.4100 -0.0327 -0.2272 -0.2516 0.0894 -0.1074 -0.2913 -0.0168 0.1744 -0.0035 0.0015 -0.1993 -0.1824 -0.1520 -0.1560 -0.1662 0.0949 0.0893 0.0948 0.0886 0.0977 0.0954 0.0994 0.0931 0.1190 0.0887 0.0942 0.0931 0.0954 0.0963 0.0883 0.1194 0.1177 0.1605 0.1712 0.1015 0.1092 0.1431 0.1383 0.1563 0.1570 0.1581
va: 2.1236 2.0321 2.2759 3.6716 3.7709 3.9083 3.9040 3.9029 3.8717 4.1765 3.7172 3.9265 3.9442 3.8228 3.6777 3.9826 3.9549 3.6804 3.8182 3.6296 3.9292 3.9334 3.8959 3.8992 3.8959 1.0282 1.0385 1.0035 1.0036 1.0028 1.0010 0.9994 1.0192 1.0083 1.0084 0.9954 0.9963 0.9973 0.9977 1.0090 0.9924 1.0109 1.0034 1.0028 1.0088 1.0046 1.0028 1.0047 0.9913 0.9909 0.9902
dispcorr: -0.022313957 hartree
energy: -1079.777257844235
dipole: 23.79313 -23.97347 -0.18034 17.55817 -16.63030 0.92787 -11.70576 12.08331 0.37754
magnitude: 1.01784 au
magnitude: 2.58715 debye
