program: Gaussian 09
title: 000062093
version: EM64L-G09RevD.01
frameworkgroup: C1[X(C21H16Br4O4)]
method: RPBEPBE
basis: SDD
operation: Freq
keyword: #p
keyword: freq=noraman
keyword: PBEPBE/SDD
title: #p freq=noraman PBEPBE/SDD
converged: YES YES NO NO
title: Mulliken charges:
elementType: Br Br Br Br O O O O C C C C C C C C C C C C C C C C C C C C C H H H H H H H H H H H H H H H H
charge: 0.042248 0.042276 0.052130 0.052114 -0.294877 -0.294885 -0.187243 -0.187246 -0.000958 0.495877 0.495874 -0.746801 -0.746769 -0.350594 -0.350467 -0.386164 -0.386409 -0.396661 -0.396246 -0.404690 -0.405113 0.605808 0.605816 0.223173 0.223167 -0.170171 -0.170174 -0.464991 -0.464992 0.244850 0.217980 0.237377 0.217961 0.237360 0.244881 0.275591 0.275592 0.268678 0.268711 0.259052 0.259053 0.232361 0.247581 0.232364 0.247581
chargesum: 0.00000
title: Mulliken charges with hydrogens summed into heavy atoms:
elementType: Br Br Br Br O O O O C C C C C C C C C C C C C C C C C C C C C
charge: 0.042248 0.042276 0.052130 0.052114 -0.294877 -0.294885 -0.187243 -0.187246 -0.000958 0.495877 0.495874 -0.046594 -0.046566 -0.075003 -0.074876 -0.117486 -0.117698 -0.396661 -0.396246 -0.404690 -0.405113 0.605808 0.605816 0.223173 0.223167 0.088880 0.088879 0.014950 0.014952
polarizability: 4.01005205e+02 -9.42110920e-02 3.12976558e+02 -4.28793579e+01 -1.54712263e-02 2.46121862e+02
1716.lowfreq: -8.4951 -4.0148 -0.0007 -0.0005 -0.0002 2.6469 9.3295 9.4117 16.0213
frequency: 7.1067 9.3875 16.0051 17.9414 20.0859 31.3816 39.6612 48.8280 49.1758 82.6005 90.8926 98.1382 99.1070 114.9082 120.7111 121.3720 127.4005 135.6661 160.9659 184.9340 188.6942 210.0504 211.0516 233.5611 242.2768 249.7566 257.0627 258.4509 281.4618 288.1028 301.1393 306.0624 319.5146 349.2479 367.5525 390.4211 405.5995 425.3704 455.0793 474.5486 485.1623 494.7891 504.1123 506.6034 544.8491 555.7355 589.6071 605.1803 609.7019 659.2764 667.8589 685.1180 713.7755 715.4777 724.0963 744.0618 768.1278 768.1622 770.4033 802.4882 827.9976 858.3590 873.1973 883.6604 887.6977 901.6817 904.9198 936.4423 936.9374 999.2162 999.2449 1001.3881 1001.4074 1009.2546 1030.9095 1033.4101 1047.5675 1049.7749 1076.7661 1077.7963 1105.3439 1127.4463 1143.3505 1202.0204 1210.4443 1215.4417 1215.9126 1231.9326 1245.9746 1288.4934 1288.5973 1343.5291 1348.5366 1373.5195 1376.8887 1386.6800 1404.3886 1410.5198 1410.8697 1437.8763 1440.3605 1467.4651 1477.9268 1489.0010 1490.9674 1540.6980 1545.5181 1584.8355 1587.8328 1639.3571 1639.4790 1668.6468 1668.9906 2981.7310 2984.5664 3079.1164 3080.2379 3088.5017 3088.8723 3106.6017 3106.6366 3156.4684 3156.6253 3165.9566 3165.9824 3178.7022 3179.0926 3222.7349 3222.7807
redmass: 10.4097 13.3078 8.7435 8.5851 10.4144 7.2859 12.1363 5.7547 6.0148 7.4897 11.8736 5.6404 31.5701 17.0639 2.8764 2.5313 5.6782 6.1029 7.1752 4.5541 4.5091 6.1349 7.2557 6.2314 6.3784 2.6314 8.3387 9.0716 4.8979 1.4969 5.0494 2.1373 1.1500 4.5082 3.7161 5.2316 4.7702 5.6164 4.0211 2.5378 2.0952 2.8388 5.1425 5.1422 5.5075 5.5135 4.3893 7.1436 6.6451 3.3389 3.5262 4.8666 8.2154 10.1632 3.4653 5.1237 3.2228 3.2053 6.1803 6.0727 3.9807 5.4966 4.3426 1.6303 1.5822 1.4225 1.3831 2.3854 1.4655 1.4045 1.4053 1.0765 1.0761 1.2997 4.7449 4.4422 2.8082 2.6459 1.9941 2.0998 2.1662 2.2024 4.0871 1.8843 1.6750 2.0218 1.7771 5.7612 4.8178 1.3958 1.3977 5.4724 5.1671 2.7213 3.9458 1.3621 1.1996 1.2307 1.2240 3.0850 3.1995 1.0668 1.0617 1.0702 1.0502 8.6000 8.7564 7.3782 7.3165 4.6996 4.7064 11.0892 11.0733 1.0352 1.0360 1.1001 1.1007 1.0996 1.0999 1.0605 1.0605 1.0922 1.0921 1.0959 1.0959 1.0917 1.0917 1.1158 1.1158
irintensity: 0.0637 0.0029 0.1986 0.0080 0.0187 0.7579 0.1703 5.4745 2.2265 0.9308 1.2838 0.0747 0.0084 0.0029 0.1677 0.0152 1.2469 0.9577 0.2622 0.3039 0.0012 0.3131 0.1222 2.2857 3.0834 0.3098 0.8785 0.0777 4.5278 3.6649 5.9278 2.8344 1.3680 5.4111 0.6906 0.5067 0.4777 6.2014 6.0168 0.2388 0.1848 0.0490 0.2668 0.0081 3.7789 2.5602 2.9155 12.5235 0.6360 4.6001 11.2145 0.0022 95.5127 38.5069 15.3624 0.0059 32.0626 12.7643 28.6705 34.9883 63.0073 41.9743 0.7991 16.0116 21.9240 7.1963 5.2225 3.8058 6.7305 46.5379 16.0871 55.3028 25.3372 1.7006 130.4913 136.0602 347.1301 355.9104 105.9022 207.4241 7.9288 6.8424 5.1019 16.1710 3.9059 21.9983 1.6023 93.3076 196.8761 29.3595 27.0715 40.6851 6.6220 17.1449 18.7520 43.8287 12.5052 80.7714 127.5185 111.1888 51.8056 0.2367 3.2270 18.7150 20.1121 116.4165 30.4184 61.9367 3.0728 55.8600 23.0213 201.0053 24.2030 20.6729 20.5565 8.6333 43.9642 47.0995 33.3773 4.2191 4.1620 1.8171 0.4796 3.0982 1.3534 0.3237 0.5130 6.9066 6.5607
temp: 298.150 k
press: 1.00000 atm
elementType: 35 35 35 35 8 8 8 8 6 6 6 6 6 6 6 6 6 6 6 6 6 6 6 6 6 6 6 6 6 1 1 1 1 1 1 1 1 1 1 1 1 1 1 1 1
symmnumber: 1
zpe: 813562.0 jmol-1
zpe.correction: 0.309869 hartree
zpe.thermalcorrener: 0.340728 hartree
zpe.thermalcorrenthalpy: 0.341672 hartree
zpe.thermalcorrgfe: 0.238939 hartree
zpe.sumelectzpe: -1162.442495 hartree
zpe.sumelectthermal: -1162.411637 hartree
zpe.sumelectthermalent: -1162.410693 hartree
zpe.sumelectthermalfe: -1162.513426 hartree
dipole: -0.0005 1.6638 -0.0004
dipole: 1.6638
quadrupole: -174.0037 -185.2770 -208.7248
quadrupole: 0.0023 4.9223 -0.0146
quadrupole: 15.3315 4.0582 -19.3896 0.0023 4.9223 -0.0146
hfenergy: -1162.7523649 hartree
pointgroup: C01 [X(C21H16Br4O4)]
dipole: -0.0025449 0.6545799 -0.0005945 debye
polarizability: 396.4421455|0.3874829|312.9782819|-50.2417842|-0.2729399|250.683198 unknown
charge 0 multiplicity 1
45 atoms
Br 5.10077 1.546787 -1.711963
Br -5.125386 1.504737 1.710343
Br 2.52587 -1.538833 2.489895
Br -2.525917 -1.561055 -2.491071
O  4.813138 -0.588011 0.570149
O  -4.820137 -0.629308 -0.57114
O  4.204028 -2.204315 -1.035426
O  -4.200482 -2.234791 1.041255
C  -0.016913 2.597239 -0.002092
C  1.253403 1.713822 0.071179
C  -1.28049 1.703635 -0.074722
C  -0.013066 3.514518 1.257536
C  -0.027816 3.513283 -1.262639
C  1.311709 0.665112 1.026719
C  -1.330293 0.654423 -1.029959
C  2.389507 1.959022 -0.735654
C  -2.418086 1.939333 0.732898
C  3.551568 1.176808 -0.584314
C  -3.573513 1.147203 0.582355
C  2.476435 -0.107233 1.167236
C  -2.48841 -0.128098 -1.169463
C  3.618554 0.134347 0.365299
C  -3.632032 0.103815 -0.366905
C  5.023802 -1.788663 -0.197808
C  -5.022929 -1.828039 0.201885
C  6.327547 -2.370317 0.194716
C  -6.32035 -2.422755 -0.192006
C  6.777849 -3.518966 -0.373795
C  -6.761412 -3.573894 0.378716
H  0.935548 4.077461 1.299534
H  -0.837277 4.249689 1.219652
H  -0.100012 2.93182 2.191738
H  0.790398 4.255134 -1.224996
H  0.064731 2.930455 -2.196205
H  -0.980946 4.068411 -1.305647
H  0.441116 0.443322 1.651268
H  -0.458297 0.440014 -1.655102
H  2.382907 2.751551 -1.486604
H  -2.417805 2.73215 1.483521
H  6.893029 -1.827468 0.958262
H  -6.889043 -1.887222 -0.958327
H  7.739694 -3.9571 -0.088843
H  6.181711 -4.035682 -1.135126
H  -7.71859 -4.021565 0.092887
H  -6.162314 -4.082973 1.142862
