program: Gaussian 09
title: 000007397
version: EM64L-G09RevD.01
frameworkgroup: C1[X(C7H7ClO2S)]
method: RPBEPBE
basis: SDD
operation: Freq
keyword: #p
keyword: freq=noraman
keyword: PBEPBE/SDD
title: #p freq=noraman PBEPBE/SDD
converged: NO NO NO NO
title: Mulliken charges:
elementType: Cl S O O C C C C C C C H H H H H H H
charge: -0.208706 0.895609 -0.459035 -0.459097 -0.091742 0.453329 -0.214281 -0.213849 -0.353476 -0.353716 -0.794464 0.288910 0.288879 0.251694 0.251719 0.234485 0.234500 0.249240
chargesum: 0.00000
title: Mulliken charges with hydrogens summed into heavy atoms:
elementType: Cl S O O C C C C C C C
charge: -0.208706 0.895609 -0.459035 -0.459097 -0.091742 0.453329 0.074629 0.075030 -0.101782 -0.101997 -0.076239
polarizability: 1.67780929e+02 6.05655607e-02 1.09038569e+02 -1.48819264e+00 4.17273100e-01 9.21929344e+01
1716.lowfreq: -54.8948 -13.2881 -3.5327 -0.0003 0.0016 0.0031 17.9934 37.0107 59.4904
frequency: -54.3363 35.9058 59.4708 129.7985 130.2820 180.3810 220.8032 244.0229 293.6669 295.8887 376.6043 396.9962 405.6985 422.0202 501.9559 582.2808 616.2303 697.0760 775.0017 822.2008 823.6886 837.0507 957.0930 961.7298 983.0126 983.9482 991.6725 1045.7840 1048.1414 1121.0257 1186.6218 1219.7255 1298.3164 1384.6732 1391.9424 1399.4159 1466.8385 1469.2140 1473.3159 1586.8863 1592.9519 2983.9280 3067.0730 3098.3581 3143.9619 3145.3778 3171.0208 3173.5859
redmass: 1.0187 4.8247 7.6961 5.4590 6.9328 16.3987 9.3980 15.8198 4.6254 5.3312 3.4832 12.6138 2.8640 9.1440 3.2619 6.0774 6.9524 3.3345 4.7661 1.3397 16.9724 1.2455 13.9528 1.2947 1.3784 6.2479 1.4321 2.3771 1.6073 1.2841 1.1278 3.1287 1.2585 6.9177 2.8023 1.2141 2.3269 1.1101 1.0613 5.8681 6.9417 1.0396 1.0941 1.1003 1.0896 1.0899 1.0956 1.0970
irintensity: 0.6122 0.0030 0.3752 1.6908 2.6207 0.9822 7.6160 2.7811 1.1980 11.3522 0.0151 28.8709 0.0075 109.9228 78.6746 19.2441 0.1622 1.4586 1.9708 56.0870 67.0432 0.4197 52.9529 1.6946 0.0911 1.0838 2.7644 27.2229 16.9362 9.2900 11.2219 9.0074 2.5211 1.9883 11.5788 20.1672 18.0596 17.9765 14.0405 25.1533 0.0021 14.0858 17.4755 12.9196 11.3283 3.7362 0.1673 9.1557
temp: 298.150 k
press: 1.00000 atm
elementType: 17 16 8 8 6 6 6 6 6 6 6 1 1 1 1 1 1 1
symmnumber: 1
zpe: 324144.0 jmol-1
zpe.correction: 0.123460 hartree
zpe.thermalcorrener: 0.134371 hartree
zpe.thermalcorrenthalpy: 0.135315 hartree
zpe.thermalcorrgfe: 0.085309 hartree
zpe.sumelectzpe: -1278.548446 hartree
zpe.sumelectthermal: -1278.537535 hartree
zpe.sumelectthermalent: -1278.536590 hartree
zpe.sumelectthermalfe: -1278.586596 hartree
dipole: 7.8324 -0.0134 0.4610
dipole: 7.8459
quadrupole: -76.6761 -75.7922 -85.9920
quadrupole: -0.0052 0.3102 0.2917
quadrupole: 2.8107 3.6946 -6.5053 -0.0052 0.3102 0.2917
hfenergy: -1278.6719055 hartree
pointgroup: C01 [X(C7H7Cl1O2S1)]
dipole: -3.085319 0.003838 0.0965168 debye
dipolederiv: -0.4454989 -0.0001031 0.1063737 -0.0005463 -0.2379816 0.0012866 0.3270222 0.0014153 -0.7865667 1.8356787 -0.0004961 -0.1536979 -0.0004535 0.9593587 -0.002168 -0.2533303 -0.0021681 1.6660274 -0.6332864 0.015114 0.0104237 0.0500118 -0.4840924 0.1482844 -0.0236863 0.0533256 -0.4931561 -0.6332431 -0.0149202 0.0099211 -0.0492825 -0.4830858 -0.1480749 -0.0242674 -0.0532449 -0.4943765 -0.0982119 0.0003306 -0.0597055 0.001212 -0.0535334 0.0004255 -0.1589916 0.001036 -0.1701704 0.6444477 -0.0009042 0.0416874 -0.0011652 0.0351496 0.000143 0.1296316 0.0000539 -0.0011034 -0.0647993 0.1068246 0.0432117 -0.2942368 -0.0319689 0.0184567 0.083802 0.0256973 -0.0830068 -0.0643125 -0.1070715 0.0420775 0.2927002 -0.0320469 -0.0177397 0.0864433 -0.0257653 -0.0831503 -0.2727725 -0.1513834 0.0074099 -0.1827867 0.0556972 -0.0138054 -0.0392686 -0.0145736 -0.1318273 -0.2721331 0.1520687 0.0090217 0.1838971 0.0547415 0.0159271 -0.0371136 0.0168832 -0.1313844 -0.2514439 0.0005031 -0.0310357 0.0015237 0.0729017 0.0002594 -0.1744481 0.0003845 0.0341966 0.1085841 -0.0649423 -0.0176937 -0.0355545 0.0819755 0.0054089 0.0142487 -0.0144575 0.145855 0.1087247 0.0649411 -0.0169148 0.0354189 0.0817091 -0.006086 0.0147907 0.0137058 0.1457817 -0.0074579 0.0827646 0.0044588 0.0691744 -0.0183429 0.0012293 -0.0220012 -0.0007354 0.1567549 -0.0077179 -0.0827946 0.0035646 -0.0690129 -0.0180358 -0.0032221 -0.0226586 -0.0011771 0.1567171 0.02346 -0.0203578 0.0179647 -0.0900132 -0.0529694 0.0911063 0.0806954 0.0724832 0.0765964 0.0234783 0.0200679 0.018168 0.0887443 -0.0510249 -0.0927424 0.0817099 -0.0742182 0.0745554 0.0065039 0.0003586 -0.0352352 0.0003691 0.1215487 0.0013114 -0.0625781 0.0013551 -0.0817427 unknown
polarizability: 166.9020819|-0.0480044|109.0473523|-8.2388396|0.171315|93.0629986 unknown
InChI: InChI=1S/C7H7O2S.Cl/c1-6-2-4-7(5-3-6)10(8)9;/h2-5H,1H3;
charge 0 multiplicity 1
18 atoms
Cl 2.777024 0.002211 -2.115915
S  2.205911 -0.003293 0.240019
O  2.707939 -1.419643 0.843665
O  2.712031 1.40793 0.852257
C  0.334179 -0.000714 0.116395
C  -2.449971 0.002456 -0.019993
C  -0.317503 1.241619 0.088276
C  -0.319669 -1.241512 0.074381
C  -1.727559 1.224627 0.026793
C  -1.729673 -1.221428 0.013007
C  -3.961841 0.004296 -0.125929
H  0.246785 2.177678 0.131999
H  0.242984 -2.17898 0.107681
H  -2.271492 2.175434 0.013461
H  -2.275215 -2.171097 -0.011117
H  -4.404437 -0.892279 0.340268
H  -4.403133 0.895482 0.351704
H  -4.277461 0.011313 -1.187152
