program: Orca
programVersion: 5.0.2
elementType: O O O C C C C C C C C C C C C C C C C C C C C C C H H H H H H H H H H H H H H H H H H H H H H H H H H
charge: 0
multiplicity: 1
keywords: wb97x-d3
keywords: def2-TZVPP
keywords: def2/J RIJCOSX
keywords: DEFGRID2
keywords: scfconv7
keywords: smallprint printgap noloewdin
keywords: NOSOSCF
formula: C22H26O3
InChI: InChI=1/C22H26O3/c1-15(2)10-19-20(22(19,3)4)21(23)25-14-17-12-18(24-13-17)11-16-8-6-5-7-9-16/h5-10,12-13,19-20H,11,14H2,1-4H3
51 atoms
O  1.39352 -1.507245 0.017922
O  1.204477 -0.427073 -1.929042
O  -2.811081 -0.042052 -0.090168
C  3.330743 1.461936 -0.580023
C  3.998969 0.564604 -1.574797
C  3.103222 -0.042267 -0.522507
C  4.155064 2.035511 0.545866
C  2.245458 2.394386 -1.056821
C  5.458775 0.287111 -1.544156
C  1.815843 -0.650419 -0.910416
C  6.38014 1.016203 -2.178984
C  7.834724 0.662313 -2.121063
C  6.05299 2.236325 -2.983707
C  0.149611 -2.187617 -0.20868
C  -1.019579 -1.33081 0.118748
C  -1.485778 -0.960753 1.422749
C  -1.865198 -0.73568 -0.753833
C  -2.575756 -0.180651 1.236098
C  -3.527393 0.478534 2.168653
C  -4.912612 -0.116688 2.07645
C  -5.830037 0.359148 1.143546
C  -5.282013 -1.178285 2.897701
C  -7.089375 -0.214746 1.032861
C  -6.542096 -1.751127 2.792497
C  -7.449738 -1.272046 1.857427
H  3.55464 0.60044 -2.566318
H  3.601741 -0.540558 0.302442
H  3.516294 2.321572 1.384025
H  4.684142 2.931837 0.213983
H  4.89964 1.334423 0.922691
H  1.487703 2.550019 -0.285763
H  1.742961 2.044751 -1.95582
H  2.680338 3.36952 -1.286827
H  5.786594 -0.574428 -0.968853
H  8.020212 -0.222068 -1.511245
H  8.232999 0.471014 -3.121193
H  8.42346 1.486098 -1.708532
H  6.554834 3.114889 -2.569071
H  6.413258 2.134739 -4.010932
H  4.986596 2.45358 -3.02397
H  0.190118 -3.051784 0.453392
H  0.094271 -2.556321 -1.233914
H  -1.064274 -1.252363 2.37241
H  -1.916826 -0.721986 -1.831448
H  -3.568922 1.552196 1.963759
H  -3.135244 0.365786 3.180186
H  -5.561634 1.188925 0.500102
H  -4.578431 -1.559798 3.628805
H  -7.791348 0.166942 0.302084
H  -6.815533 -2.572545 3.442761
H  -8.432595 -1.718204 1.7740
elementType: O C H
totalener: -1079.75417805 hartree
nucrepener: 2031.14615457 hartree
electener: -3110.90033262 hartree
oneelecener: -5501.68797257 hartree
twoeener: 2390.78763995 hartree
cpcmener: -0.02512349 hartree
kineticenergy: 1074.86293250 hartree
xcener: -106.459911099166 hartree
chargesum: -0.0000000
charge: -0.285984 -0.475004 -0.279101 0.121904 -0.022971 -0.104918 -0.274606 -0.297177 -0.244832 0.409415 -0.040806 -0.230564 -0.248256 0.084844 -0.081658 -0.332970 -0.015140 0.199442 -0.060712 0.068085 -0.196201 -0.205841 -0.157883 -0.149559 -0.173617 0.100138 0.090090 0.100898 0.096884 0.090784 0.102381 0.094752 0.095379 0.119563 0.089293 0.095201 0.093407 0.096640 0.101391 0.086912 0.120370 0.118086 0.159830 0.170682 0.115746 0.107404 0.139219 0.139397 0.155670 0.156425 0.157567
qa: -0.2860 -0.4750 -0.2791 0.1219 -0.0230 -0.1049 -0.2746 -0.2972 -0.2448 0.4094 -0.0408 -0.2306 -0.2483 0.0848 -0.0817 -0.3330 -0.0151 0.1994 -0.0607 0.0681 -0.1962 -0.2058 -0.1579 -0.1496 -0.1736 0.1001 0.0901 0.1009 0.0969 0.0908 0.1024 0.0948 0.0954 0.1196 0.0893 0.0952 0.0934 0.0966 0.1014 0.0869 0.1204 0.1181 0.1598 0.1707 0.1157 0.1074 0.1392 0.1394 0.1557 0.1564 0.1576
va: 2.1226 2.0331 2.2822 3.6742 3.8088 3.8584 3.9070 3.8984 3.8504 4.1859 3.7102 3.9292 3.9357 3.8380 3.6141 4.0116 3.9525 3.6303 3.8264 3.5664 3.9541 3.9473 3.9004 3.8899 3.9027 1.0257 1.0354 1.0030 1.0002 1.0031 0.9997 1.0186 1.0005 1.0067 1.0075 0.9957 0.9962 0.9975 0.9997 1.0083 0.9912 1.0096 1.0077 1.0014 1.0032 1.0097 1.0091 1.0042 0.9913 0.9908 0.9903
dispcorr: -0.022532489 hartree
energy: -1079.776710536309
dipole: 30.58854 -29.91770 0.67085 13.01921 -12.91611 0.10310 -5.07095 6.04538 0.97443
magnitude: 1.18751 au
magnitude: 3.01841 debye
