program: Orca
programVersion: 5.0.2
elementType: O O O C C C C C C C C C C C C C C C C C C C C C C H H H H H H H H H H H H H H H H H H H H H H H H H H
charge: 0
multiplicity: 1
keywords: wb97x-d3
keywords: def2-TZVPP
keywords: def2/J RIJCOSX
keywords: DEFGRID2
keywords: scfconv7
keywords: smallprint printgap noloewdin
keywords: NOSOSCF
formula: C22H26O3
InChI: InChI=1/C22H26O3/c1-15(2)10-19-20(22(19,3)4)21(23)25-14-17-12-18(24-13-17)11-16-8-6-5-7-9-16/h5-10,12-13,19-20H,11,14H2,1-4H3
51 atoms
O  1.729864 -2.096963 -1.069899
O  1.962465 -1.810159 1.134312
O  -2.125286 -2.815802 1.012734
C  3.660569 0.693844 0.399323
C  2.235749 1.131826 0.474174
C  2.604775 -0.067926 -0.381859
C  4.614648 1.496779 -0.452951
C  4.320999 0.103633 1.620732
C  1.777537 2.406592 -0.135259
C  2.087735 -1.39304 0.007031
C  0.792825 2.572715 -1.022625
C  0.453004 3.934884 -1.547086
C  -0.044123 1.460762 -1.576562
C  0.976722 -3.302007 -0.864778
C  -0.377087 -2.983193 -0.339612
C  -1.335089 -2.093635 -0.922821
C  -0.916852 -3.385837 0.833294
C  -2.37105 -2.01853 -0.054238
C  -3.59696 -1.176333 -0.0264
C  -3.302181 0.278191 0.273553
C  -2.342424 0.643615 1.216272
C  -3.994435 1.284162 -0.393425
C  -2.079744 1.979819 1.480171
C  -3.73837 2.623539 -0.126709
C  -2.777912 2.97676 0.810166
H  1.742013 0.866245 1.407494
H  2.616101 0.106506 -1.451716
H  5.459105 0.880173 -0.767655
H  5.017513 2.342268 0.108871
H  4.141876 1.892204 -1.352225
H  4.838954 0.893802 2.168856
H  5.068008 -0.643257 1.344128
H  3.618948 -0.361077 2.30829
H  2.303795 3.294036 0.209014
H  0.548514 3.970285 -2.635792
H  -0.585092 4.193473 -1.320537
H  1.093536 4.711427 -1.128776
H  0.175264 1.298889 -2.636121
H  0.094494 0.516476 -1.056961
H  -1.104475 1.719457 -1.520045
H  1.506832 -3.991658 -0.205157
H  0.926935 -3.756827 -1.853717
H  -1.249098 -1.558041 -1.855972
H  -0.567365 -4.046757 1.611305
H  -4.293459 -1.573352 0.717594
H  -4.108957 -1.248019 -0.987923
H  -1.783313 -0.116995 1.748443
H  -4.739538 1.019906 -1.135109
H  -1.324029 2.242766 2.209659
H  -4.28801 3.390821 -0.65743
H  -2.572663 4.019524 1.016176
elementType: O C H
totalener: -1079.74945352 hartree
nucrepener: 2248.98168215 hartree
electener: -3328.73113568 hartree
oneelecener: -5937.43590319 hartree
twoeener: 2608.70476751 hartree
cpcmener: -0.02377763 hartree
kineticenergy: 1074.85584691 hartree
xcener: -106.463617444040 hartree
chargesum: -0.0000000
charge: -0.288428 -0.469556 -0.274048 0.147341 -0.000297 -0.111336 -0.280498 -0.287180 -0.296707 0.379001 -0.019343 -0.223369 -0.221003 0.090784 -0.053786 -0.379637 -0.027977 0.241689 -0.032034 0.018369 -0.197504 -0.192672 -0.141643 -0.125797 -0.204226 0.101260 0.101893 0.098276 0.097620 0.090160 0.091865 0.097438 0.093085 0.118283 0.097167 0.091249 0.089292 0.118924 0.049375 0.093482 0.116044 0.120157 0.161666 0.173452 0.103520 0.104066 0.137914 0.136019 0.155223 0.155260 0.157164
qa: -0.2884 -0.4696 -0.2740 0.1473 -0.0003 -0.1113 -0.2805 -0.2872 -0.2967 0.3790 -0.0193 -0.2234 -0.2210 0.0908 -0.0538 -0.3796 -0.0280 0.2417 -0.0320 0.0184 -0.1975 -0.1927 -0.1416 -0.1258 -0.2042 0.1013 0.1019 0.0983 0.0976 0.0902 0.0919 0.0974 0.0931 0.1183 0.0972 0.0912 0.0893 0.1189 0.0494 0.0935 0.1160 0.1202 0.1617 0.1735 0.1035 0.1041 0.1379 0.1360 0.1552 0.1553 0.1572
va: 2.1078 2.0334 2.2711 3.7137 3.7797 3.8365 3.9026 3.8880 3.8670 4.1631 3.7362 3.9250 3.9101 3.8507 3.6268 3.9488 3.9521 3.5837 3.8025 3.6602 3.8577 3.9445 3.8210 3.8601 3.8707 1.0238 1.0277 1.0027 1.0014 1.0042 1.0007 0.9989 1.0218 1.0058 0.9973 0.9973 1.0071 1.0035 1.0139 0.9998 1.0057 0.9894 1.0064 0.9955 1.0111 1.0066 1.0114 1.0044 0.9932 0.9908 0.9916
dispcorr: -0.029535427 hartree
energy: -1079.778988950449
dipole: 11.96814 -12.20485 -0.23671 18.81343 -18.32028 0.49315 -5.54162 4.33635 -1.20528
magnitude: 1.32360 au
magnitude: 3.36432 debye
