program: Orca
programVersion: 5.0.2
elementType: O O O C C C C C C C C C C C C C C C C C C C C C C H H H H H H H H H H H H H H H H H H H H H H H H H H
charge: 0
multiplicity: 1
keywords: wb97x-d3
keywords: def2-TZVPP
keywords: def2/J RIJCOSX
keywords: DEFGRID2
keywords: scfconv7
keywords: smallprint printgap noloewdin
keywords: NOSOSCF
formula: C22H26O3
InChI: InChI=1/C22H26O3/c1-15(2)10-19-20(22(19,3)4)21(23)25-14-17-12-18(24-13-17)11-16-8-6-5-7-9-16/h5-10,12-13,19-20H,11,14H2,1-4H3
51 atoms
O  1.246326 -1.489327 -0.429468
O  1.169503 0.099959 -1.998525
O  -2.83978 0.291615 -0.116782
C  3.44436 1.352284 -0.214188
C  4.033763 0.708248 -1.432372
C  3.07853 -0.081069 -0.565022
C  4.312772 1.525527 1.007964
C  2.447577 2.470095 -0.393909
C  5.453856 0.293132 -1.500517
C  1.747475 -0.44522 -1.087718
C  6.391733 0.843522 -2.277169
C  7.798761 0.327727 -2.271986
C  6.148528 1.999564 -3.198189
C  -0.050547 -1.969036 -0.81672
C  -1.141971 -1.126369 -0.26303
C  -1.537716 -1.009735 1.109658
C  -1.968652 -0.307446 -0.95263
C  -2.571341 -0.136504 1.139795
C  -3.447446 0.363867 2.23156
C  -4.840529 -0.2128 2.138231
C  -5.812628 0.392604 1.346575
C  -5.160968 -1.388274 2.811455
C  -7.077465 -0.167527 1.227611
C  -6.425784 -1.948401 2.697672
C  -7.387897 -1.340501 1.902514
H  3.600405 1.053273 -2.366183
H  3.526078 -0.830214 0.079693
H  3.69986 1.633827 1.904994
H  4.923216 2.426479 0.914713
H  4.988499 0.686177 1.170271
H  1.72202 2.485382 0.422427
H  1.897744 2.409667 -1.330371
H  2.970426 3.42899 -0.384561
H  5.747286 -0.531177 -0.85647
H  8.100091 -0.001759 -3.270129
H  8.504187 1.110625 -1.980501
H  7.927995 -0.51213 -1.589086
H  6.404905 1.738013 -4.228264
H  5.11993 2.355778 -3.190773
H  6.78935 2.843133 -2.928087
H  -0.097825 -2.977763 -0.40775
H  -0.124957 -2.046338 -1.902616
H  -1.108827 -1.521015 1.957766
H  -2.049759 -0.061839 -2.000291
H  -3.49015 1.456278 2.207263
H  -2.98984 0.08605 3.181801
H  -5.582717 1.311881 0.820395
H  -4.414316 -1.86934 3.432714
H  -7.822494 0.31424 0.607094
H  -6.660342 -2.860517 3.231911
H  -8.37444 -1.776712 1.811775
elementType: O C H
totalener: -1079.75485057 hartree
nucrepener: 2029.08136257 hartree
electener: -3108.83621313 hartree
oneelecener: -5497.54819714 hartree
twoeener: 2388.71198401 hartree
cpcmener: -0.02561980 hartree
kineticenergy: 1074.86453297 hartree
xcener: -106.460780496576 hartree
chargesum: -0.0000000
charge: -0.285488 -0.473698 -0.279044 0.145145 0.011184 -0.135675 -0.262254 -0.289152 -0.272424 0.410132 -0.033887 -0.225167 -0.251185 0.088621 -0.078381 -0.337675 -0.018913 0.207387 -0.066821 0.066661 -0.199294 -0.204137 -0.155711 -0.149312 -0.174426 0.093646 0.089329 0.097677 0.095181 0.088450 0.098522 0.092816 0.094543 0.118697 0.093720 0.092705 0.088266 0.095571 0.088502 0.095398 0.120546 0.116798 0.158727 0.171587 0.116143 0.107624 0.139356 0.139584 0.156310 0.156662 0.157155
qa: -0.2855 -0.4737 -0.2790 0.1451 0.0112 -0.1357 -0.2623 -0.2892 -0.2724 0.4101 -0.0339 -0.2252 -0.2512 0.0886 -0.0784 -0.3377 -0.0189 0.2074 -0.0668 0.0667 -0.1993 -0.2041 -0.1557 -0.1493 -0.1744 0.0936 0.0893 0.0977 0.0952 0.0884 0.0985 0.0928 0.0945 0.1187 0.0937 0.0927 0.0883 0.0956 0.0885 0.0954 0.1205 0.1168 0.1587 0.1716 0.1161 0.1076 0.1394 0.1396 0.1563 0.1567 0.1572
va: 2.1224 2.0344 2.2805 3.6709 3.7680 3.9051 3.9050 3.9025 3.8730 4.1683 3.7222 3.9253 3.9450 3.8398 3.6164 4.0124 3.9552 3.6209 3.8268 3.5676 3.9587 3.9461 3.8986 3.8910 3.9035 1.0298 1.0384 1.0028 1.0031 1.0036 0.9995 1.0195 1.0009 1.0084 0.9955 0.9964 1.0084 0.9977 1.0089 0.9974 0.9905 1.0095 1.0088 0.9998 1.0055 1.0102 1.0097 1.0042 0.9910 0.9907 0.9906
dispcorr: -0.021973032 hartree
energy: -1079.776823598526
dipole: 31.44504 -30.80677 0.63827 10.08496 -10.35265 -0.26770 -3.44776 4.33816 0.89040
magnitude: 1.12777 au
magnitude: 2.86656 debye
