program: Orca
programVersion: 5.0.2
elementType: O O O C C C C C C C C C C C C C C C C C C C C C C H H H H H H H H H H H H H H H H H H H H H H H H H H
charge: 0
multiplicity: 1
keywords: wb97x-d3
keywords: def2-TZVPP
keywords: def2/J RIJCOSX
keywords: DEFGRID2
keywords: scfconv7
keywords: smallprint printgap noloewdin
keywords: NOSOSCF
formula: C22H26O3
InChI: InChI=1/C22H26O3/c1-15(2)10-19-20(22(19,3)4)21(23)25-14-17-12-18(24-13-17)11-16-8-6-5-7-9-16/h5-10,12-13,19-20H,11,14H2,1-4H3
51 atoms
O  1.707665 -2.002463 -0.576665
O  2.489759 -1.133411 1.328368
O  -1.774785 -0.317011 1.604639
C  4.877169 -0.170092 -0.488968
C  3.880102 0.925837 -0.341059
C  3.411206 -0.453874 -0.77491
C  5.775671 -0.18388 -1.702463
C  5.540017 -0.732755 0.744209
C  3.769158 2.05922 -1.295477
C  2.526406 -1.21444 0.122403
C  2.610757 2.600985 -1.681192
C  2.55845 3.734149 -2.658358
C  1.279293 2.109697 -1.19783
C  0.632547 -2.642767 0.126209
C  -0.433024 -1.663188 0.463172
C  -1.256304 -0.932274 -0.455484
C  -0.79238 -1.23588 1.694526
C  -2.048641 -0.129444 0.292678
C  -3.119551 0.843186 -0.046406
C  -4.462543 0.414302 0.492414
C  -5.261926 -0.467225 -0.230155
C  -4.906937 0.85934 1.733399
C  -6.482627 -0.891867 0.274478
C  -6.127132 0.434408 2.242292
C  -6.919423 -0.441373 1.513526
H  3.626889 1.161725 0.690535
H  3.167158 -0.553737 -1.826499
H  6.657348 0.438884 -1.535769
H  5.276151 0.181603 -2.600116
H  6.124561 -1.197351 -1.910165
H  5.775134 -1.791417 0.61517
H  4.93316 -0.630749 1.640937
H  6.481058 -0.209075 0.926334
H  4.694934 2.469351 -1.689839
H  2.114466 4.624586 -2.205242
H  3.545938 4.003296 -3.033416
H  1.929715 3.480064 -3.516199
H  0.613588 2.946248 -0.9764
H  0.783157 1.515913 -1.969993
H  1.347236 1.497572 -0.301356
H  0.996287 -3.157265 1.017028
H  0.266725 -3.39779 -0.568815
H  -1.256323 -1.003698 -1.532166
H  -0.449471 -1.48877 2.68576
H  -3.157533 0.931397 -1.133023
H  -2.862579 1.83311 0.341317
H  -4.926719 -0.824243 -1.197227
H  -4.29716 1.548157 2.306272
H  -7.095446 -1.573601 -0.301647
H  -6.459854 0.7908 3.208915
H  -7.872221 -0.770575 1.907931
elementType: O C H
totalener: -1079.75304282 hartree
nucrepener: 2106.22165693 hartree
electener: -3185.97469975 hartree
oneelecener: -5651.75903009 hartree
twoeener: 2465.78433033 hartree
cpcmener: -0.02504245 hartree
kineticenergy: 1074.88080426 hartree
xcener: -106.464251380816 hartree
chargesum: -0.0000000
charge: -0.286099 -0.472959 -0.279453 0.152623 -0.010303 -0.079473 -0.284101 -0.281901 -0.312590 0.359017 0.008752 -0.228172 -0.256754 0.091975 -0.055465 -0.392096 -0.020844 0.223646 -0.047347 0.064857 -0.203512 -0.196857 -0.154739 -0.157969 -0.170015 0.102574 0.089275 0.098003 0.092203 0.097052 0.098381 0.092294 0.093020 0.120626 0.096484 0.088731 0.094112 0.102660 0.103884 0.084145 0.115464 0.120188 0.156649 0.172503 0.110756 0.112992 0.139743 0.139052 0.156208 0.155675 0.157107
qa: -0.2861 -0.4730 -0.2795 0.1526 -0.0103 -0.0795 -0.2841 -0.2819 -0.3126 0.3590 0.0088 -0.2282 -0.2568 0.0920 -0.0555 -0.3921 -0.0208 0.2236 -0.0473 0.0649 -0.2035 -0.1969 -0.1547 -0.1580 -0.1700 0.1026 0.0893 0.0980 0.0922 0.0971 0.0984 0.0923 0.0930 0.1206 0.0965 0.0887 0.0941 0.1027 0.1039 0.0841 0.1155 0.1202 0.1566 0.1725 0.1108 0.1130 0.1397 0.1391 0.1562 0.1557 0.1571
va: 2.1059 2.0270 2.2794 3.7025 3.8088 3.7855 3.9068 3.8893 3.9059 4.1854 3.7026 3.9334 3.9471 3.8408 3.5974 3.9825 3.9672 3.6010 3.8028 3.5709 3.9460 3.9560 3.8969 3.9003 3.8990 1.0260 1.0337 0.9999 1.0018 1.0032 0.9990 1.0203 1.0012 1.0046 0.9959 1.0064 0.9958 1.0007 0.9962 1.0047 1.0095 0.9902 1.0118 0.9988 1.0086 1.0046 1.0044 1.0074 0.9911 0.9914 0.9906
dispcorr: -0.024265997 hartree
energy: -1079.777308814254
dipole: 18.79981 -19.00216 -0.20236 10.85767 -10.70217 0.15550 -11.15261 9.85401 -1.29860
magnitude: 1.32344 au
magnitude: 3.36391 debye
