program: Orca
programVersion: 5.0.2
elementType: O O O C C C C C C C C C C C C C C C C C C C C C C H H H H H H H H H H H H H H H H H H H H H H H H H H
charge: 0
multiplicity: 1
keywords: wb97x-d3
keywords: def2-TZVPP
keywords: def2/J RIJCOSX
keywords: DEFGRID2
keywords: scfconv7
keywords: smallprint printgap noloewdin
keywords: NOSOSCF
formula: C22H26O3
InChI: InChI=1/C22H26O3/c1-15(2)10-19-20(22(19,3)4)21(23)25-14-17-12-18(24-13-17)11-16-8-6-5-7-9-16/h5-10,12-13,19-20H,11,14H2,1-4H3
51 atoms
O  1.708929 -1.932695 -0.463895
O  2.467289 -1.003591 1.422419
O  -1.855895 -0.295756 1.662832
C  4.888265 -0.123664 -0.388354
C  3.900683 0.986645 -0.301965
C  3.424369 -0.403235 -0.689957
C  5.806576 -0.195579 -1.584803
C  5.525033 -0.640045 0.878143
C  3.824817 2.08458 -1.299453
C  2.518491 -1.122516 0.22022
C  2.683657 2.631886 -1.725839
C  2.673117 3.733135 -2.740389
C  1.333713 2.17577 -1.256911
C  0.638845 -2.568545 0.248313
C  -0.443844 -1.598039 0.555878
C  -1.241849 -0.866544 -0.384298
C  -0.861536 -1.199452 1.778297
C  -2.079351 -0.091254 0.343583
C  -3.165477 0.854964 -0.022416
C  -4.519577 0.34048 0.404153
C  -5.036211 0.653374 1.657867
C  -5.252621 -0.49563 -0.433601
C  -6.260073 0.140915 2.067428
C  -6.478153 -1.005777 -0.028869
C  -6.985038 -0.690473 1.224993
H  3.63075 1.265259 0.714759
H  3.198477 -0.543302 -1.740937
H  5.324448 0.135609 -2.504901
H  6.149052 -1.22003 -1.743732
H  6.691436 0.425712 -1.430273
H  4.904126 -0.496181 1.759372
H  6.466687 -0.115668 1.054671
H  5.754433 -1.704649 0.797607
H  4.765054 2.465165 -1.689454
H  2.230223 4.643703 -2.32814
H  3.674402 3.97645 -3.096143
H  2.064508 3.460437 -3.607044
H  0.857002 1.540781 -2.00961
H  1.367162 1.612844 -0.325445
H  0.667073 3.027552 -1.105466
H  1.003643 -3.056221 1.153839
H  0.287128 -3.345556 -0.429797
H  -1.196201 -0.920184 -1.461176
H  -0.553799 -1.462811 2.778521
H  -3.136834 0.995739 -1.103708
H  -2.977888 1.833249 0.429489
H  -4.480668 1.307308 2.319878
H  -4.860462 -0.750386 -1.411688
H  -6.649675 0.395499 3.045049
H  -7.037718 -1.651727 -0.693712
H  -7.940638 -1.088403 1.541816
elementType: O C H
totalener: -1079.75298002 hartree
nucrepener: 2101.37503510 hartree
electener: -3181.12801512 hartree
oneelecener: -5642.06442819 hartree
twoeener: 2460.93641307 hartree
cpcmener: -0.02521200 hartree
kineticenergy: 1074.87267987 hartree
xcener: -106.462434079665 hartree
chargesum: -0.0000000
charge: -0.286132 -0.473295 -0.279614 0.152669 -0.011585 -0.082167 -0.284821 -0.282168 -0.310087 0.363856 0.006558 -0.228191 -0.256591 0.092496 -0.049127 -0.394400 -0.026344 0.229081 -0.051965 0.066389 -0.198156 -0.206029 -0.157767 -0.152364 -0.171791 0.102528 0.089255 0.092354 0.097136 0.098043 0.092480 0.093136 0.098427 0.120649 0.096234 0.088516 0.094417 0.103576 0.084881 0.102668 0.115238 0.120458 0.156742 0.172671 0.108541 0.114784 0.138520 0.140638 0.156170 0.156069 0.157414
qa: -0.2861 -0.4733 -0.2796 0.1527 -0.0116 -0.0822 -0.2848 -0.2822 -0.3101 0.3639 0.0066 -0.2282 -0.2566 0.0925 -0.0491 -0.3944 -0.0263 0.2291 -0.0520 0.0664 -0.1982 -0.2060 -0.1578 -0.1524 -0.1718 0.1025 0.0893 0.0924 0.0971 0.0980 0.0925 0.0931 0.0984 0.1206 0.0962 0.0885 0.0944 0.1036 0.0849 0.1027 0.1152 0.1205 0.1567 0.1727 0.1085 0.1148 0.1385 0.1406 0.1562 0.1561 0.1574
va: 2.1070 2.0278 2.2796 3.7024 3.8109 3.7885 3.9076 3.8892 3.9049 4.1792 3.7008 3.9340 3.9475 3.8410 3.5936 3.9851 3.9706 3.5984 3.8100 3.5741 3.9578 3.9482 3.9007 3.8955 3.9016 1.0254 1.0336 1.0018 1.0031 0.9999 1.0203 1.0011 0.9990 1.0043 0.9959 1.0065 0.9956 0.9963 1.0053 1.0007 1.0093 0.9895 1.0121 0.9976 1.0098 1.0050 1.0087 1.0041 0.9912 0.9911 0.9905
dispcorr: -0.024076253 hartree
energy: -1079.777056276010
dipole: 19.26464 -19.43177 -0.16713 10.71598 -10.61439 0.10159 -11.30158 10.00122 -1.30037
magnitude: 1.31499 au
magnitude: 3.34244 debye
